program: Orca
programVersion: 5.0.2
elementType: S F F O O N N N N N C C C C C C C C C C C C H H H H H H H H H
charge: 0
multiplicity: 1
keywords: wb97x-d3
keywords: def2-TZVPP
keywords: def2/J RIJCOSX
keywords: DEFGRID2
keywords: scfconv7
keywords: smallprint printgap noloewdin
keywords: NOSOSCF
formula: C12H9F2N5O2S
InChI: InChI=1/C12H9F2N5O2S/c1-7-5-6-19-11(15-7)16-12(17-19)22(20,21)18-10-8(13)3-2-4-9(10)14/h2-6,18H,1H3
31 atoms
S  -0.834142 -1.838974 -0.632419
F  -0.478914 1.750183 -0.803832
F  -4.115847 -0.958927 0.31015
O  -1.372956 -2.321738 0.618667
O  -0.598559 -2.703401 -1.765006
N  2.076929 0.063612 0.762557
N  -1.829814 -0.63407 -1.168694
N  0.885561 -0.506244 0.934155
N  1.640891 -0.863154 -1.172454
N  3.715618 0.308295 -0.928266
C  0.697412 -1.032447 -0.253182
C  2.540086 -0.155232 -0.511376
C  -2.264253 0.34866 -0.257606
C  2.78902 0.775765 1.666009
C  4.428737 1.003203 -0.076122
C  3.983536 1.261686 1.25243
C  -1.577832 1.544205 -0.073181
C  -3.41969 0.159575 0.491816
C  -1.996756 2.511576 0.813656
C  -3.867097 1.097098 1.399786
C  5.744829 1.537595 -0.521845
C  -3.145269 2.270874 1.553555
H  -1.636293 -0.334201 -2.120934
H  2.362045 0.911473 2.649148
H  4.592631 1.84123 1.930569
H  -1.435697 3.429645 0.924412
H  -4.767852 0.914406 1.970029
H  6.544067 1.187485 0.133411
H  5.749414 2.628073 -0.472608
H  5.966155 1.232675 -1.541746
H  -3.486568 3.015523 2.259516
elementType: S F O N C H
totalener: -1484.88923387 hartree
nucrepener: 2044.53438755 hartree
electener: -3529.42362142 hartree
oneelecener: -6100.60622097 hartree
twoeener: 2571.18259955 hartree
cpcmener: -0.04646381 hartree
kineticenergy: 1479.88743740 hartree
xcener: -117.700897045762 hartree
chargesum: 0.0000000
charge: 0.866835 -0.206118 -0.197583 -0.486859 -0.493934 0.155139 -0.204803 -0.318852 -0.321436 -0.331076 0.052344 0.287588 0.059580 0.040060 0.195618 -0.167921 0.207619 0.222475 -0.162411 -0.165667 -0.234796 -0.123083 0.195652 0.181218 0.160258 0.152700 0.151524 0.110655 0.111810 0.098461 0.165003
qa: 0.8668 -0.2061 -0.1976 -0.4869 -0.4939 0.1551 -0.2048 -0.3189 -0.3214 -0.3311 0.0523 0.2876 0.0596 0.0401 0.1956 -0.1679 0.2076 0.2225 -0.1624 -0.1657 -0.2348 -0.1231 0.1957 0.1812 0.1603 0.1527 0.1515 0.1107 0.1118 0.0985 0.1650
va: 5.8570 1.0867 1.1004 2.0049 2.0203 3.4199 3.0261 2.8382 3.0499 3.0437 4.1931 4.2701 3.5848 3.9685 3.8546 3.9041 4.0110 4.1083 3.9151 3.8827 3.9219 3.8593 1.0131 0.9953 0.9920 0.9977 0.9983 0.9968 0.9965 1.0192 0.9855
dispcorr: -0.015304195 hartree
energy: -1484.904538065044
dipole: 17.18879 -15.18923 1.99955 13.06991 -8.44874 4.62117 5.79454 -3.49572 2.29883
magnitude: 5.53516 au
magnitude: 14.06926 debye
