program: Orca
programVersion: 5.0.2
elementType: S F F O O N N N N N C C C C C C C C C C C C H H H H H H H H H
charge: 0
multiplicity: 1
keywords: wb97x-d3
keywords: def2-TZVPP
keywords: def2/J RIJCOSX
keywords: DEFGRID2
keywords: scfconv7
keywords: smallprint printgap noloewdin
keywords: NOSOSCF
formula: C12H9F2N5O2S
InChI: InChI=1/C12H9F2N5O2S/c1-7-5-6-19-11(15-7)16-12(17-19)22(20,21)18-10-8(13)3-2-4-9(10)14/h2-6,18H,1H3
31 atoms
S  -0.738818 -1.52364 -0.32111
F  -0.738795 1.387339 0.934475
F  -4.362612 -0.421491 -1.381368
O  -1.211433 -1.749153 1.027761
O  -0.634808 -2.594643 -1.289534
N  2.690384 -0.29983 0.558388
N  -1.642477 -0.332611 -1.000294
N  1.55745 -0.906012 0.913318
N  1.446012 -0.211912 -1.239297
N  3.627788 0.774382 -1.329007
C  0.876982 -0.811735 -0.200694
C  2.623583 0.126134 -0.744387
C  -2.519767 0.464264 -0.252969
C  3.786408 -0.090394 1.321607
C  4.703913 0.995487 -0.613661
C  4.817525 0.566418 0.738853
C  -2.05603 1.344869 0.715708
C  -3.893335 0.423876 -0.461135
C  -2.897404 2.150282 1.451739
C  -4.768626 1.23118 0.233912
C  5.842933 1.714058 -1.247795
C  -4.259444 2.089558 1.196941
H  -1.769456 -0.396809 -2.004445
H  3.768379 -0.456755 2.337513
H  5.718166 0.761117 1.30215
H  -2.493514 2.816744 2.201809
H  -5.830332 1.177991 0.034097
H  6.146192 2.56893 -0.641888
H  5.581894 2.060971 -2.244474
H  6.710376 1.055575 -1.323715
H  -4.934548 2.722173 1.756603
elementType: S F O N C H
totalener: -1484.88819938 hartree
nucrepener: 2001.90279693 hartree
electener: -3486.79099631 hartree
oneelecener: -6015.78919550 hartree
twoeener: 2528.99819919 hartree
cpcmener: -0.04246388 hartree
kineticenergy: 1479.89754160 hartree
xcener: -117.706693441798 hartree
chargesum: -0.0000000
charge: 0.869615 -0.206510 -0.205918 -0.487504 -0.499937 0.146804 -0.219661 -0.307736 -0.346904 -0.333363 0.094180 0.277112 0.027572 0.045253 0.195163 -0.173452 0.269251 0.228371 -0.171620 -0.180678 -0.234217 -0.119460 0.202248 0.181012 0.160837 0.153279 0.151835 0.109481 0.097839 0.112674 0.164433
qa: 0.8696 -0.2065 -0.2059 -0.4875 -0.4999 0.1468 -0.2197 -0.3077 -0.3469 -0.3334 0.0942 0.2771 0.0276 0.0453 0.1952 -0.1735 0.2693 0.2284 -0.1716 -0.1807 -0.2342 -0.1195 0.2022 0.1810 0.1608 0.1533 0.1518 0.1095 0.0978 0.1127 0.1644
va: 5.8462 1.0893 1.0884 2.0015 1.9967 3.4250 3.0515 2.8522 3.0483 3.0437 4.1798 4.3045 3.6120 3.9677 3.8540 3.9073 3.9562 4.0715 3.9574 3.8943 3.9231 3.8502 1.0086 0.9955 0.9918 0.9982 0.9984 0.9970 1.0191 0.9963 0.9858
dispcorr: -0.014033232 hartree
energy: -1484.902232614314
dipole: 16.91312 -14.70442 2.20871 10.19505 -7.26174 2.93331 2.25138 -0.90676 1.34462
magnitude: 3.91033 au
magnitude: 9.93927 debye
