program: Orca
programVersion: 5.0.2
elementType: S F F O O N N N N N C C C C C C C C C C C C H H H H H H H H H
charge: 0
multiplicity: 1
keywords: wb97x-d3
keywords: def2-TZVPP
keywords: def2/J RIJCOSX
keywords: DEFGRID2
keywords: scfconv7
keywords: smallprint printgap noloewdin
keywords: NOSOSCF
formula: C12H9F2N5O2S
InChI: InChI=1/C12H9F2N5O2S/c1-7-5-6-19-11(15-7)16-12(17-19)22(20,21)18-10-8(13)3-2-4-9(10)14/h2-6,18H,1H3
31 atoms
S  -0.823555 -1.811228 -0.451149
F  -0.55217 1.856008 -0.750419
F  -4.13626 -0.976597 0.209271
O  -1.388251 -2.148412 0.828124
O  -0.587203 -2.75513 -1.509421
N  2.237064 -0.050209 0.859274
N  -1.766151 -0.606758 -1.112087
N  1.072167 -0.652476 1.089116
N  1.539888 -0.643381 -1.128749
N  3.646744 0.496867 -0.969219
C  0.718796 -0.982916 -0.134034
C  2.523959 -0.043426 -0.492443
C  -2.301777 0.385411 -0.275504
C  3.07851 0.485524 1.768169
C  4.47882 1.020504 -0.109584
C  4.222667 1.035994 1.29471
C  -1.685514 1.616993 -0.086278
C  -3.495812 0.164084 0.403917
C  -2.207641 2.592563 0.735969
C  -4.037776 1.107806 1.254367
C  5.744457 1.621454 -0.628857
C  -3.385318 2.319223 1.414247
H  -1.473821 -0.335647 -2.042964
H  2.782958 0.436104 2.805641
H  4.932951 1.477758 1.977793
H  -1.697895 3.539378 0.844289
H  -4.961727 0.893356 1.772405
H  6.614923 1.15233 -0.16789
H  5.792729 2.686353 -0.395505
H  5.808415 1.496791 -1.705942
H  -3.804828 3.066367 2.073235
totalener: -1484.85469952 hartree
nucrepener: 2031.29598770 hartree
electener: -3516.15068722 hartree
oneelecener: -6073.36796506 hartree
twoeener: 2557.21727784 hartree
kineticenergy: 1479.90619923 hartree
xcener: -117.695420287816 hartree
chargesum: -0.0000000
charge: 0.843771 -0.195732 -0.170539 -0.424645 -0.427510 0.146056 -0.203067 -0.286811 -0.266366 -0.262544 0.046879 0.246692 0.027169 0.018411 0.150786 -0.166466 0.194723 0.228868 -0.152975 -0.144030 -0.238385 -0.104361 0.159999 0.158718 0.132078 0.124954 0.125760 0.096871 0.098188 0.111169 0.132338
qa: 0.8438 -0.1957 -0.1705 -0.4246 -0.4275 0.1461 -0.2031 -0.2868 -0.2664 -0.2625 0.0469 0.2467 0.0272 0.0184 0.1508 -0.1665 0.1947 0.2289 -0.1530 -0.1440 -0.2384 -0.1044 0.1600 0.1587 0.1321 0.1250 0.1258 0.0969 0.0982 0.1112 0.1323
va: 5.8934 1.0990 1.1412 2.0742 2.0931 3.3767 3.0431 2.7812 3.0493 3.0574 4.1433 4.2650 3.6687 3.9979 3.8791 3.8909 4.0532 4.1357 3.9369 3.9198 3.9021 3.9008 1.0396 1.0054 1.0031 1.0068 1.0078 0.9984 0.9980 1.0201 0.9971
dispcorr: -0.014903171 hartree
energy: -1484.869602694663
dipole: 17.39904 -15.77964 1.61940 12.46875 -9.57699 2.89176 5.06111 -3.59809 1.46302
magnitude: 3.62287 au
magnitude: 9.20859 debye
