program: Orca
programVersion: 5.0.2
elementType: S F F O O N N N N N C C C C C C C C C C C C H H H H H H H H H
charge: 0
multiplicity: 1
keywords: wb97x-d3
keywords: def2-TZVPP
keywords: def2/J RIJCOSX
keywords: DEFGRID2
keywords: scfconv7
keywords: smallprint printgap noloewdin
keywords: NOSOSCF
formula: C12H9F2N5O2S
InChI: InChI=1/C12H9F2N5O2S/c1-7-5-6-19-11(15-7)16-12(17-19)22(20,21)18-10-8(13)3-2-4-9(10)14/h2-6,18H,1H3
31 atoms
S  -0.846823 -1.896825 -0.369233
F  -0.374744 1.21484 1.528052
F  -4.124701 -0.773446 -0.423009
O  -0.570724 -3.217105 0.127136
O  -1.511392 -1.624624 -1.614925
N  2.098605 0.387692 -0.897767
N  -1.708041 -1.111856 0.825126
N  0.919124 -0.07879 -1.302789
N  1.598769 -1.153503 0.574692
N  3.671583 0.028468 0.842133
C  0.68674 -0.993376 -0.38527
C  2.513913 -0.265258 0.247208
C  -2.219164 0.167994 0.549446
C  2.840297 1.356918 -1.473945
C  4.407514 0.963966 0.30483
C  4.016905 1.665032 -0.876171
C  -1.545199 1.334314 0.894868
C  -3.440627 0.312659 -0.102524
C  -2.042286 2.591533 0.624909
C  -3.962376 1.555543 -0.406244
C  5.705448 1.305994 0.96188
C  -3.256402 2.689145 -0.037323
H  -1.347947 -1.283098 1.756086
H  2.445871 1.816685 -2.368153
H  4.6510 2.432991 -1.294141
H  -1.485992 3.469432 0.92212
H  -4.911686 1.626721 -0.918189
H  5.888938 0.645963 1.805352
H  5.697403 2.337217 1.320297
H  6.534357 1.217465 0.25752
H  -3.660014 3.665683 -0.266487
totalener: -1484.85426427 hartree
nucrepener: 2042.29718113 hartree
electener: -3527.15144540 hartree
oneelecener: -6095.32173076 hartree
twoeener: 2568.17028535 hartree
kineticenergy: 1479.89044676 hartree
xcener: -117.691980109902 hartree
chargesum: 0.0000000
charge: 0.843220 -0.197490 -0.169717 -0.426094 -0.424379 0.146850 -0.198533 -0.287897 -0.261695 -0.262640 0.039810 0.247511 0.025300 0.017734 0.150700 -0.165516 0.196008 0.229011 -0.153436 -0.144577 -0.238365 -0.103866 0.157969 0.158017 0.132304 0.125315 0.125630 0.111380 0.098214 0.096818 0.132416
qa: 0.8432 -0.1975 -0.1697 -0.4261 -0.4244 0.1468 -0.1985 -0.2879 -0.2617 -0.2626 0.0398 0.2475 0.0253 0.0177 0.1507 -0.1655 0.1960 0.2290 -0.1534 -0.1446 -0.2384 -0.1039 0.1580 0.1580 0.1323 0.1253 0.1256 0.1114 0.0982 0.0968 0.1324
va: 5.8914 1.0961 1.1431 2.0958 2.0735 3.3781 3.0461 2.7781 3.0498 3.0574 4.1500 4.2609 3.6779 3.9992 3.8805 3.8898 4.0406 4.1369 3.9392 3.9200 3.9026 3.9011 1.0413 1.0057 1.0030 1.0065 1.0078 1.0199 0.9983 0.9984 0.9969
dispcorr: -0.015221992 hartree
energy: -1484.869486257999
dipole: 17.06235 -15.50083 1.56152 14.27370 -10.88846 3.38524 0.29198 -0.33747 -0.04549
magnitude: 3.72830 au
magnitude: 9.47659 debye
