program: Gaussian 09
title: 000073910
version: EM64L-G09RevD.01
frameworkgroup: C1[X(C12H10ClOP)]
method: RPBEPBE
basis: SDD
operation: Freq
keyword: #p
keyword: freq=noraman
keyword: PBEPBE/SDD
title: #p freq=noraman PBEPBE/SDD
converged: YES YES NO NO
title: Mulliken charges:
elementType: Cl P O C C C C C C C C C C C C H H H H H H H H H H
charge: -0.203097 0.782337 -0.580670 -0.076324 -0.088109 -0.249551 -0.223317 -0.283252 -0.286763 -0.225970 -0.220760 -0.205376 -0.205028 -0.217831 -0.218843 0.258599 0.242902 0.282409 0.289489 0.238273 0.237391 0.239658 0.239462 0.237375 0.236997
chargesum: 0.00000
title: Mulliken charges with hydrogens summed into heavy atoms:
elementType: Cl P O C C C C C C C C C C C C
charge: -0.203097 0.782337 -0.580670 -0.076324 -0.088109 0.009048 0.019585 -0.000843 0.002726 0.012303 0.016632 0.034282 0.034434 0.019544 0.018153
polarizability: 1.99347633e+02 -2.53596876e+00 1.23234919e+02 -5.31118109e+00 5.95617454e+00 1.60047553e+02
1716.lowfreq: -6.6799 0.0018 0.0021 0.0027 6.6270 8.0970 15.8333 39.9555 55.8297
frequency: 15.4452 39.9533 55.7562 93.7301 110.0416 163.6465 193.5955 209.0436 231.7174 263.7710 275.6365 372.9203 393.9421 399.1700 430.5035 447.9638 500.7673 522.1012 608.3638 610.0746 672.9311 694.1121 700.7096 702.9273 760.7862 768.1259 850.0761 860.7302 930.6546 939.0084 982.8904 984.6231 985.1149 985.8477 1003.1123 1005.9859 1006.9181 1020.1877 1022.2935 1079.5466 1082.7372 1085.0780 1091.7286 1175.9138 1176.7486 1189.4710 1194.8300 1308.9758 1315.9396 1379.8021 1382.6865 1425.0708 1428.6493 1463.3691 1465.4526 1585.5965 1588.2854 1592.5007 1594.7989 3132.9203 3133.4169 3141.2385 3142.5042 3149.3141 3151.1165 3159.8624 3161.1260 3171.4048 3172.2015
redmass: 3.7241 4.9869 4.8184 9.1375 8.7216 5.6265 8.4157 5.6898 5.3970 11.7153 7.0723 8.1746 2.7712 2.8348 7.9374 5.2965 5.7756 4.2967 6.4573 6.4789 6.6914 2.0784 2.4201 3.4026 1.6654 1.6652 1.2582 1.2417 1.3742 1.3748 1.5469 5.2564 2.4636 1.9617 8.0643 1.3606 1.3418 2.9378 3.1482 1.6138 2.0596 2.8133 2.1179 1.0547 1.0546 1.1252 1.1236 1.3251 1.3030 8.5563 8.9893 2.1082 2.1292 2.0291 2.0136 6.0124 6.0148 5.8826 5.8939 1.0853 1.0854 1.0880 1.0881 1.0926 1.0926 1.0969 1.0967 1.1018 1.1017
irintensity: 0.0458 0.6324 0.4074 0.8609 0.8581 2.4084 3.0291 11.8315 5.0171 3.3904 5.6306 10.2062 0.3147 0.3112 40.4857 23.9286 111.4788 114.6817 0.1410 0.3222 7.4705 20.7288 65.8407 65.9405 14.2615 47.1173 0.7131 0.4228 0.2105 1.0780 0.4701 3.1743 3.8052 4.4521 39.5394 0.8403 0.2709 2.7522 7.5251 0.6822 22.1418 62.5971 9.6772 0.0556 0.0472 8.9231 0.8971 1.3923 8.5398 0.2526 1.2108 4.4183 37.7589 12.0443 3.3204 0.6174 0.8425 0.0415 0.8102 0.1747 0.4193 1.5482 9.4465 7.2043 2.2967 6.3803 21.5641 35.3396 15.4090
temp: 298.150 k
press: 1.00000 atm
elementType: 17 15 8 6 6 6 6 6 6 6 6 6 6 6 6 1 1 1 1 1 1 1 1 1 1
symmnumber: 1
zpe: 484113.5 jmol-1
zpe.correction: 0.184389 hartree
zpe.thermalcorrener: 0.198141 hartree
zpe.thermalcorrenthalpy: 0.199085 hartree
zpe.thermalcorrgfe: 0.141407 hartree
zpe.sumelectzpe: -1338.739924 hartree
zpe.sumelectthermal: -1338.726173 hartree
zpe.sumelectthermalent: -1338.725228 hartree
zpe.sumelectthermalfe: -1338.782907 hartree
dipole: 0.1331 -5.6783 -1.4792
dipole: 5.8693
quadrupole: -80.5316 -111.5730 -97.8629
quadrupole: -0.6135 -1.2024 0.2996
quadrupole: 16.1242 -14.9171 -1.2071 -0.6135 -1.2024 0.2996
hfenergy: -1338.9243136 hartree
pointgroup: C01 [X(C12H10Cl1O1P1)]
dipole: -0.0724101 2.1342586 0.8785673 debye
dipolederiv: -0.4650962 -0.0142961 -0.0006348 -0.0173623 -0.3090337 -0.039297 -0.0275763 -0.1806262 -0.9397135 2.0648252 0.0653227 -0.0052353 0.0602211 1.1777307 0.2387489 0.0009877 0.3170367 1.6371672 -0.8220538 -0.0162681 -0.0014778 -0.0256953 -0.6228095 0.0362133 -0.0068088 0.0143128 -0.5700375 -0.300469 -0.0186583 -0.0378223 -0.0589561 -0.2707998 -0.0728143 -0.0066167 -0.0866653 -0.2531331 -0.3615498 -0.0136023 0.0279441 0.07654 -0.2535996 -0.0659667 0.0689829 -0.0544234 -0.2315732 -0.1128224 0.0468422 -0.0818282 -0.101745 -0.0560079 0.056146 0.0630789 -0.0823249 -0.0324261 -0.0733626 -0.0980817 0.0603327 0.0974101 -0.018069 0.0386739 -0.0143106 -0.0729624 -0.0683939 -0.1096441 -0.0824257 0.0642248 0.1602107 -0.0542644 -0.1558457 -0.1399019 0.0332794 -0.0176159 -0.0843705 0.1103911 -0.0135891 -0.2308072 -0.0388183 -0.1246089 0.0848614 0.0194418 -0.0663111 -0.1305301 -0.0699629 0.086301 -0.055014 0.0190462 -0.1294717 0.058828 -0.1046708 -0.0304581 -0.1638612 0.0384754 -0.0366174 0.0186828 0.0869756 -0.1145493 -0.0283808 -0.0906714 -0.0845932 -0.059936 0.0629152 -0.1356037 0.0032311 -0.0999708 -0.0223288 -0.0893452 -0.0723888 0.0502069 -0.0013975 -0.1092752 0.1297486 -0.0455265 -0.0902542 -0.0438065 0.1006253 -0.0670041 -0.0207094 0.064679 -0.1147478 -0.0667055 -0.0881999 -0.0252656 -0.0349881 -0.0798169 -0.0185924 -0.0276284 0.0697345 0.0989883 0.0739479 0.0674161 0.0121127 -0.0322033 0.077912 -0.0192762 -0.0752042 0.1014738 -0.0258218 0.0748926 -0.0155343 0.1132979 0.0200412 0.0891752 0.0385072 0.0274903 0.0502207 0.0495848 -0.0858851 0.0502129 0.0857334 0.025182 -0.1010945 0.0376112 0.0673118 0.1345841 0.052433 -0.041413 0.0242919 0.0641255 0.0706788 -0.0243631 0.0421423 0.0976115 0.1582528 -0.0337099 0.0242943 0.004151 0.0398404 0.0546203 0.0067287 0.0337655 0.1230234 0.0608208 0.0736001 -0.0045944 0.096576 0.0142971 0.096698 -0.0199678 0.106088 0.0382441 0.0733988 -0.0390611 -0.0269017 -0.0632399 -0.0621031 0.082632 -0.0127198 0.0930194 0.1003307 0.0240455 0.0122385 0.1049604 0.0095015 0.1023341 0.0618995 0.1179785 0.0608981 -0.0133512 -0.0251645 0.0217847 -0.1091777 0.0286233 0.0692997 0.0645753 -0.1173486 0.0642811 0.0665742 -0.0467829 0.1027236 0.0566811 0.1140353 0.0699969 -0.0041083 0.061832 -0.0043388 0.101252 -0.0449946 -0.0993887 -0.0558415 -0.1090234 0.0462056 -0.0061204 -0.0627394 -0.0064388 0.1219368 unknown
polarizability: 199.473205|-4.6681392|142.1626086|2.7268995|-19.2894127|140.9942911 unknown
InChI: InChI=1S/C12H10OP.Cl/c13-14(11-7-3-1-4-8-11)12-9-5-2-6-10-12;/h1-10H;
charge 0 multiplicity 1
25 atoms
Cl 0.023241 -1.332026 -2.83746
P  0.03485 -1.227983 -0.528132
O  0.100827 -2.635777 0.230224
C  -1.53574 -0.288596 -0.205404
C  1.545515 -0.18985 -0.22453
C  -1.989958 0.748485 -1.051439
C  1.712832 1.093374 -0.793674
C  -2.267051 -0.663655 0.947569
C  2.531585 -0.74706 0.62368
C  -3.179188 1.435526 -0.723062
C  2.878338 1.832613 -0.496563
C  -3.456694 0.028658 1.265348
C  3.695152 -0.000156 0.912801
C  -3.909195 1.080523 0.43579
C  3.868036 1.28775 0.355815
H  -1.450547 0.988381 -1.973591
H  0.958285 1.511986 -1.467425
H  -1.913185 -1.492101 1.57065
H  2.380084 -1.748898 1.040505
H  -3.541322 2.236377 -1.376334
H  3.016838 2.827193 -0.933508
H  -4.029263 -0.257378 2.153908
H  4.463628 -0.424117 1.567692
H  -4.833993 1.612984 0.683719
H  4.772324 1.864048 0.58042
