program: Orca
programVersion: 4.2.1
elementType: S F F F O O O O O O N N N N C C C C C C C C C C C C H H H H H H H H H H H
charge: 0
multiplicity: 1
keywords: wb97x-d3
keywords: def2-TZVPP
keywords: def2/J RIJCOSX GRIDX6 NOFINALGRIDX
keywords: grid4 nofinalgrid
keywords: scfconv7
keywords: smallprint printgap noloewdin
keywords: NOSOSCF
formula: C12H11F3N4O6S
InChI: InChI=1/C12H11F3N4O6S/c1-18-10(24-2)16-19(11(18)21)9(20)17-26(22,23)8-6-4-3-5-7(8)25-12(13,14)15/h3-6,17H,1-2H3
37 atoms
S  2.048427 -1.647621 0.484124
F  0.209474 2.982994 1.642487
F  -0.749222 1.154576 2.222668
F  -0.433699 1.601101 0.134018
O  1.258415 1.023338 1.46034
O  2.19977 -1.726733 1.921326
O  2.601403 -2.688092 -0.353505
O  -4.28669 -0.385776 0.863109
O  0.512285 -1.18823 -1.991698
O  -1.958677 -0.16407 -3.048838
N  0.395777 -1.569938 0.247344
N  -1.499905 -1.053437 -0.925519
N  -3.420187 -0.12401 -1.246055
N  -2.164845 -1.123117 0.282806
C  2.636183 -0.089997 -0.112064
C  2.189603 1.10685 0.443327
C  -0.137461 -1.271971 -0.979879
C  3.592027 -0.082444 -1.116656
C  -2.251366 -0.412448 -1.904261
C  -3.294588 -0.5602 0.038194
C  2.696941 2.311886 -0.001462
C  4.095555 1.125619 -1.569419
C  3.648218 2.312339 -1.012855
C  -4.561291 0.555621 -1.820501
C  0.089734 1.690903 1.35726
C  -4.096419 -0.841738 2.209326
H  -0.194236 -1.586779 1.075346
H  3.939181 -1.007721 -1.552732
H  2.380278 3.24963 0.431891
H  4.83622 1.134521 -2.355922
H  4.042438 3.257189 -1.359542
H  -4.752052 1.490763 -1.300185
H  -5.444599 -0.07631 -1.777849
H  -4.340783 0.775102 -2.860346
H  -5.00971 -0.591576 2.738325
H  -3.252787 -0.333666 2.67462
H  -3.939875 -1.919125 2.234871
elementType: S F O N C H
totalener: -1832.19116533 hartree
nucrepener: 2919.99239707 hartree
electener: -4752.18356240 hartree
oneelecener: -8328.51351451 hartree
twoeener: 3576.32995211 hartree
cpcmener: -0.05477718 hartree
kineticenergy: 1826.02765435 hartree
xcener: -145.198008598020 hartree
chargesum: 0.0000000
charge: 0.881572 -0.160622 -0.155044 -0.171805 -0.298243 -0.502482 -0.493351 -0.295493 -0.428787 -0.474763 -0.183755 0.035633 -0.116961 -0.404195 -0.032116 0.166495 0.340176 -0.082341 0.382604 0.439786 -0.136023 -0.159529 -0.106758 -0.155824 0.599053 -0.110319 0.211065 0.157482 0.159946 0.169672 0.171654 0.132742 0.130907 0.111414 0.137619 0.117275 0.123314
qa: 0.8816 -0.1606 -0.1550 -0.1718 -0.2982 -0.5025 -0.4934 -0.2955 -0.4288 -0.4748 -0.1838 0.0356 -0.1170 -0.4042 -0.0321 0.1665 0.3402 -0.0823 0.3826 0.4398 -0.1360 -0.1595 -0.1068 -0.1558 0.5991 -0.1103 0.2111 0.1575 0.1599 0.1697 0.1717 0.1327 0.1309 0.1114 0.1376 0.1173 0.1233
va: 5.8313 1.1523 1.1562 1.1220 2.1005 1.9887 2.0058 2.1452 2.0795 2.0440 3.1321 3.1457 3.2909 2.7664 3.7472 3.8967 4.4136 3.9352 4.3098 4.1148 3.9947 3.9393 3.9110 3.8527 4.5774 3.8332 1.0278 1.0130 1.0070 0.9859 0.9836 0.9904 0.9909 1.0157 0.9911 0.9957 0.9935
dispcorr: -0.021746465 hartree
energy: -1832.212911796296
dipole: -10.24233 7.56971 -2.67262 -1.14110 3.79378 2.65268 -5.56190 7.08610 1.52420
magnitude: 4.06237 au
magnitude: 10.32572 debye
