program: Orca
programVersion: 4.2.1
elementType: S F F F O O O O O O N N N N C C C C C C C C C C C C H H H H H H H H H H H
charge: 0
multiplicity: 1
keywords: wb97x-d3
keywords: def2-TZVPP
keywords: def2/J RIJCOSX GRIDX6 NOFINALGRIDX
keywords: grid4 nofinalgrid
keywords: scfconv7
keywords: smallprint printgap noloewdin
keywords: NOSOSCF
formula: C12H11F3N4O6S
InChI: InChI=1/C12H11F3N4O6S/c1-18-10(24-2)16-19(11(18)21)9(20)17-26(22,23)8-6-4-3-5-7(8)25-12(13,14)15/h3-6,17H,1-2H3
37 atoms
S  2.021576 -1.619829 0.443789
F  -0.54581 1.238019 2.372727
F  -0.301755 1.747029 0.289095
F  0.461336 3.047212 1.813096
O  1.417354 1.056846 1.517065
O  2.191474 -1.728206 1.876022
O  2.510274 -2.666232 -0.423632
O  -4.358226 -0.393789 0.861058
O  0.453229 -1.126795 -2.012754
O  -2.109914 -0.323815 -3.104742
N  0.370958 -1.445508 0.237817
N  -1.536449 -0.935899 -0.912325
N  -3.542461 -0.237591 -1.279961
N  -2.180402 -0.9641 0.307366
C  2.668752 -0.077279 -0.138698
C  2.303198 1.123984 0.46323
C  -0.178689 -1.175658 -0.989875
C  3.581377 -0.089112 -1.18248
C  -2.357465 -0.478586 -1.936005
C  -3.362928 -0.543305 0.033683
C  2.847056 2.315651 0.0242
C  4.122957 1.105358 -1.627517
C  3.754634 2.297313 -1.025913
C  -4.741544 0.293708 -1.887583
C  0.276961 1.770084 1.487106
C  -4.111675 -0.730859 2.230883
H  -0.210878 -1.473782 1.070646
H  3.864408 -1.020033 -1.652385
H  2.590585 3.255844 0.491311
H  4.831247 1.100708 -2.44377
H  4.175859 3.231863 -1.369774
H  -5.007788 1.248011 -1.438278
H  -5.56933 -0.404451 -1.78423
H  -4.548703 0.449994 -2.94507
H  -3.855348 -1.785358 2.332591
H  -5.03849 -0.528098 2.75816
H  -3.312876 -0.116659 2.646408
elementType: S F O N C H
totalener: -1832.19381269 hartree
nucrepener: 2896.08598079 hartree
electener: -4728.27979348 hartree
oneelecener: -8280.62706610 hartree
twoeener: 3552.34727261 hartree
cpcmener: -0.04454465 hartree
kineticenergy: 1826.04144231 hartree
xcener: -145.198366862881 hartree
chargesum: 0.0000000
charge: 0.869723 -0.158397 -0.169499 -0.164585 -0.293702 -0.490981 -0.479336 -0.295610 -0.407304 -0.444818 -0.193332 0.048626 -0.128701 -0.398260 -0.033695 0.161049 0.333578 -0.077851 0.366090 0.432856 -0.135484 -0.156367 -0.108686 -0.158269 0.597689 -0.113511 0.207270 0.156012 0.156218 0.165734 0.167522 0.129786 0.128091 0.112555 0.122128 0.135897 0.117566
qa: 0.8697 -0.1584 -0.1695 -0.1646 -0.2937 -0.4910 -0.4793 -0.2956 -0.4073 -0.4448 -0.1933 0.0486 -0.1287 -0.3983 -0.0337 0.1610 0.3336 -0.0779 0.3661 0.4329 -0.1355 -0.1564 -0.1087 -0.1583 0.5977 -0.1135 0.2073 0.1560 0.1562 0.1657 0.1675 0.1298 0.1281 0.1126 0.1221 0.1359 0.1176
va: 5.8510 1.1529 1.1270 1.1455 2.1071 2.0035 2.0227 2.1434 2.1086 2.0843 3.1280 3.1341 3.2883 2.7773 3.7672 3.9088 4.4161 3.9353 4.3339 4.1240 3.9965 3.9403 3.9145 3.8555 4.5856 3.8379 1.0301 1.0144 1.0087 0.9874 0.9853 0.9907 0.9909 1.0163 0.9939 0.9915 0.9956
dispcorr: -0.021135026 hartree
energy: -1832.214947720370
dipole: -11.22846 8.73241 -2.49604 -1.98992 4.44221 2.45229 -6.35007 7.74088 1.39081
magnitude: 3.76541 au
magnitude: 9.57092 debye
