program: Orca
programVersion: 4.2.1
elementType: S F F F O O O O O O N N N N C C C C C C C C C C C C H H H H H H H H H H H
charge: 0
multiplicity: 1
keywords: wb97x-d3
keywords: def2-TZVPP
keywords: def2/J RIJCOSX GRIDX6 NOFINALGRIDX
keywords: grid4 nofinalgrid
keywords: scfconv7
keywords: smallprint printgap noloewdin
keywords: NOSOSCF
formula: C12H11F3N4O6S
InChI: InChI=1/C12H11F3N4O6S/c1-18-10(24-2)16-19(11(18)21)9(20)17-26(22,23)8-6-4-3-5-7(8)25-12(13,14)15/h3-6,17H,1-2H3
37 atoms
S  2.013685 -1.549103 -0.342132
F  -0.106699 1.914692 -0.359504
F  0.107112 1.634489 -2.488043
F  1.03647 3.309016 -1.522686
O  1.818071 1.241676 -1.247288
O  2.277502 -2.707833 0.479445
O  2.452366 -1.526772 -1.719735
O  -4.949713 -0.692287 1.466839
O  0.015366 -1.298123 1.812785
O  -1.880582 -0.851757 -1.902496
N  0.364389 -1.285222 -0.433073
N  -1.762013 -1.027217 0.426491
N  -3.699346 -0.716753 -0.460276
N  -2.648227 -0.982289 1.477041
C  2.603533 -0.120369 0.518184
C  2.450306 1.151681 -0.026772
C  -0.413226 -1.218129 0.692494
C  3.26041 -0.29138 1.727021
C  -2.385892 -0.862737 -0.797057
C  -3.779999 -0.799443 0.900668
C  2.957735 2.255756 0.630852
C  3.760463 0.81551 2.392787
C  3.608582 2.078458 1.844354
C  -4.791584 -0.50704 -1.38426
C  0.729459 2.020243 -1.39031
C  -4.985004 -0.803915 2.893932
H  -0.055878 -1.231808 -1.363327
H  3.37727 -1.277529 2.153047
H  2.870469 3.247828 0.210897
H  4.269968 0.686547 3.337226
H  4.002916 2.944172 2.358555
H  -5.264457 0.456146 -1.20607
H  -5.528963 -1.300903 -1.290644
H  -4.39456 -0.518719 -2.394981
H  -4.613548 -1.775679 3.21893
H  -6.028896 -0.700748 3.173478
H  -4.400436 -0.012292 3.362273
elementType: S F O N C H
totalener: -1832.19664521 hartree
nucrepener: 2863.50298696 hartree
electener: -4695.69963217 hartree
oneelecener: -8216.15563533 hartree
twoeener: 3520.45600316 hartree
cpcmener: -0.04129427 hartree
kineticenergy: 1826.03902972 hartree
xcener: -145.199453142788 hartree
chargesum: -0.0000000
charge: 0.870599 -0.171194 -0.155796 -0.165629 -0.293003 -0.480881 -0.490621 -0.299957 -0.408765 -0.485890 -0.219346 0.048680 -0.122212 -0.372249 -0.029047 0.155965 0.333109 -0.075863 0.394681 0.436898 -0.136161 -0.156339 -0.109019 -0.158901 0.591195 -0.114571 0.217282 0.155741 0.156287 0.166173 0.167672 0.130321 0.129898 0.113996 0.120972 0.133959 0.122015
qa: 0.8706 -0.1712 -0.1558 -0.1656 -0.2930 -0.4809 -0.4906 -0.3000 -0.4088 -0.4859 -0.2193 0.0487 -0.1222 -0.3722 -0.0290 0.1560 0.3331 -0.0759 0.3947 0.4369 -0.1362 -0.1563 -0.1090 -0.1589 0.5912 -0.1146 0.2173 0.1557 0.1563 0.1662 0.1677 0.1303 0.1299 0.1140 0.1210 0.1340 0.1220
va: 5.8452 1.1254 1.1586 1.1434 2.1047 2.0229 2.0025 2.1371 2.1120 2.0279 3.1223 3.1662 3.3212 2.8071 3.7712 3.9139 4.4398 3.9257 4.2702 4.1184 3.9931 3.9366 3.9117 3.8587 4.6035 3.8364 1.0457 1.0146 1.0083 0.9873 0.9853 0.9909 0.9915 1.0134 0.9950 0.9908 0.9942
dispcorr: -0.020289431 hartree
energy: -1832.216934640466
dipole: -15.69962 12.79874 -2.90087 -5.47641 7.70069 2.22428 14.69770 -13.24737 1.45033
magnitude: 3.93268 au
magnitude: 9.99607 debye
