program: Orca
programVersion: 5.0.2
elementType: S F F F O O O N N N N N C C C C C C C C C C C C H H H H H H H H
charge: 0
multiplicity: 1
keywords: wb97x-d3
keywords: def2-TZVPP
keywords: def2/J RIJCOSX
keywords: DEFGRID2
keywords: scfconv7
keywords: smallprint printgap noloewdin
keywords: NOSOSCF
formula: C12H8F3N5O3S
InChI: InChI=1/C12H8F3N5O3S/c1-23-12-16-5-8(15)10-17-11(18-20(10)12)24(21,22)19-9-6(13)3-2-4-7(9)14/h2-5,19H,1H3
32 atoms
S  0.973553 1.904637 0.67308
F  -1.884295 -2.885139 1.777467
F  0.806361 -0.583749 -1.947904
F  4.397457 1.133887 0.494852
O  1.680704 1.485316 1.861446
O  0.506582 3.262118 0.49888
O  -3.769769 0.840776 -1.573957
N  -2.200958 0.099842 -0.155589
N  1.930093 1.567573 -0.62893
N  -1.41172 1.166754 -0.27945
N  -0.494988 -0.341329 1.147243
N  -4.058873 -1.204676 -0.553802
C  -0.431401 0.827777 0.513119
C  -1.64465 -0.802007 0.70421
C  2.57126 0.313264 -0.7122
C  -3.402632 -0.12208 -0.776369
C  -2.37858 -1.978482 0.941037
C  2.010552 -0.759336 -1.397557
C  3.826406 0.117314 -0.147478
C  -3.561159 -2.134009 0.301109
C  2.650669 -1.971374 -1.533563
C  4.495578 -1.085001 -0.247657
C  3.898112 -2.123514 -0.946441
C  -5.01993 0.704485 -2.262262
H  1.572359 1.94998 -1.502267
H  -4.160006 -3.022858 0.450997
H  2.182565 -2.777456 -2.081943
H  5.471095 -1.203105 0.203841
H  4.415321 -3.068374 -1.037704
H  -5.119326 1.605714 -2.858592
H  -5.847271 0.63808 -1.557859
H  -5.013731 -0.167939 -2.913071
elementType: S F O N C H
totalener: -1659.35739821 hartree
nucrepener: 2369.37792772 hartree
electener: -4028.73532593 hartree
oneelecener: -6990.56264605 hartree
twoeener: 2961.82732013 hartree
cpcmener: -0.04735955 hartree
kineticenergy: 1653.86478846 hartree
xcener: -131.106153653699 hartree
chargesum: -0.0000000
charge: 0.877867 -0.197834 -0.206792 -0.200877 -0.495377 -0.503820 -0.276994 0.179747 -0.206647 -0.292048 -0.338111 -0.394339 0.071825 0.199449 0.064900 0.445821 0.174598 0.211040 0.220733 0.020293 -0.162811 -0.169083 -0.121888 -0.111207 0.201320 0.150379 0.156256 0.154828 0.168878 0.135738 0.122365 0.121791
qa: 0.8779 -0.1978 -0.2068 -0.2009 -0.4954 -0.5038 -0.2770 0.1797 -0.2066 -0.2920 -0.3381 -0.3943 0.0718 0.1994 0.0649 0.4458 0.1746 0.2110 0.2207 0.0203 -0.1628 -0.1691 -0.1219 -0.1112 0.2013 0.1504 0.1563 0.1548 0.1689 0.1357 0.1224 0.1218
va: 5.8431 1.0984 1.0855 1.0957 2.0012 2.0007 2.1664 3.4234 3.0334 2.9099 3.0720 3.0406 4.1681 3.9389 3.5835 4.1329 3.9681 4.0065 4.1042 3.9959 3.9135 3.8799 3.8521 3.8270 1.0096 0.9957 0.9963 0.9972 0.9842 0.9925 0.9956 0.9956
dispcorr: -0.015984182 hartree
energy: -1659.373382393890
dipole: -9.40820 7.45951 -1.94869 -3.60422 0.82699 -2.77723 -10.31879 7.27911 -3.03968
magnitude: 4.55523 au
magnitude: 11.57847 debye
