program: Orca
programVersion: 5.0.2
elementType: S F F F O O O N N N N N C C C C C C C C C C C C H H H H H H H H
charge: 0
multiplicity: 1
keywords: wb97x-d3
keywords: def2-TZVPP
keywords: def2/J RIJCOSX
keywords: DEFGRID2
keywords: scfconv7
keywords: smallprint printgap noloewdin
keywords: NOSOSCF
formula: C12H8F3N5O3S
InChI: InChI=1/C12H8F3N5O3S/c1-23-12-16-5-8(15)10-17-11(18-20(10)12)24(21,22)19-9-6(13)3-2-4-7(9)14/h2-5,19H,1H3
32 atoms
S  1.13822 0.552226 1.56599
F  -3.683477 3.017367 -0.167748
F  4.459603 0.400324 0.895303
F  0.980164 -1.501279 -1.566702
O  0.960998 0.250337 2.968598
O  1.744116 1.785583 1.120347
O  -3.05403 -2.300759 -0.217003
N  -2.261279 -0.240729 0.174548
N  1.967137 -0.69308 0.89969
N  -1.059758 -0.647376 0.588626
N  -1.193369 1.611735 0.644342
N  -4.414505 -0.484613 -0.600818
C  -0.487222 0.497988 0.845649
C  -2.336727 1.123378 0.212427
C  2.688055 -0.539679 -0.29781
C  -3.305039 -1.022344 -0.238197
C  -3.558368 1.695282 -0.189975
C  3.964408 0.012718 -0.277579
C  2.19694 -0.959141 -1.528597
C  -4.554451 0.864476 -0.580631
C  4.723166 0.157108 -1.420042
C  2.927992 -0.84406 -2.692651
C  4.192561 -0.278499 -2.625469
C  -4.095201 -3.18869 -0.639195
H  1.685746 -1.624602 1.191383
H  -5.513349 1.25782 -0.893977
H  5.712286 0.591427 -1.36647
H  2.51428 -1.186902 -3.631468
H  4.777084 -0.178141 -3.529753
H  -4.97309 -3.093847 -0.001332
H  -3.679732 -4.187296 -0.544262
H  -4.371403 -3.00288 -1.67634
elementType: S F O N C H
totalener: -1659.35321576 hartree
nucrepener: 2333.78236382 hartree
electener: -3993.13557958 hartree
oneelecener: -6919.40007371 hartree
twoeener: 2926.26449413 hartree
cpcmener: -0.03929087 hartree
kineticenergy: 1653.85555516 hartree
xcener: -131.107371128113 hartree
chargesum: 0.0000000
charge: 0.864969 -0.194615 -0.199226 -0.201793 -0.489592 -0.482401 -0.272260 0.164196 -0.224645 -0.323238 -0.347681 -0.395045 0.145831 0.188849 0.050580 0.441843 0.173818 0.239931 0.226151 0.015584 -0.172254 -0.178253 -0.114157 -0.112039 0.202350 0.147849 0.152065 0.152093 0.165546 0.120318 0.134717 0.120509
qa: 0.8650 -0.1946 -0.1992 -0.2018 -0.4896 -0.4824 -0.2723 0.1642 -0.2246 -0.3232 -0.3477 -0.3950 0.1458 0.1888 0.0506 0.4418 0.1738 0.2399 0.2262 0.0156 -0.1723 -0.1783 -0.1142 -0.1120 0.2023 0.1478 0.1521 0.1521 0.1655 0.1203 0.1347 0.1205
va: 5.8630 1.1020 1.0983 1.0924 2.0053 2.0110 2.1698 3.4452 3.0453 2.8755 3.1118 3.0414 4.1073 3.9594 3.5710 4.1369 3.9753 4.0645 4.0414 3.9971 3.9031 3.9209 3.8471 3.8312 1.0072 0.9964 0.9988 0.9987 0.9854 0.9964 0.9925 0.9961
dispcorr: -0.015123175 hartree
energy: -1659.368338934085
dipole: -5.19693 3.59026 -1.60668 -12.54528 9.66836 -2.87692 -8.95793 5.99919 -2.95874
magnitude: 4.42857 au
magnitude: 11.25653 debye
