program: Gaussian 09
title: 000073915
version: EM64L-G09RevD.01
frameworkgroup: C1[X(C11H18O5)]
method: RPBEPBE
basis: SDD
operation: Freq
keyword: #pfreq=noraman
keyword: PBEPBE/SDD
title: #p freq=noraman PBEPBE/SDD
converged: YES YES NO NO
title: Mulliken charges:
elementType: O O O O O C C C C C C C C C C C H H H H H H H H H H H H H H H H H H
charge: -0.260998 -0.263238 -0.201037 -0.248860 -0.251542 -0.305384 -0.411429 -0.537461 0.223364 0.232579 0.247341 -0.783671 -0.225719 -0.225057 -0.670417 -0.672836 0.274266 0.250002 0.250300 0.281531 0.273843 0.270369 0.235029 0.254218 0.228234 0.233642 0.225243 0.227839 0.214645 0.234464 0.229584 0.209521 0.230099 0.231538
chargesum: 0.00000
title: Mulliken charges with hydrogens summed into heavy atoms:
elementType: O O O O O C C C C C C C C C C C
charge: -0.260998 -0.263238 -0.201037 -0.248860 -0.251542 -0.031118 0.088873 0.017912 0.223364 0.232579 0.247341 -0.024055 0.236157 0.228025 0.008276 -0.001679
polarizability: 1.61860203e+02 -8.77377633e+00 1.31578074e+02 -1.24555849e+00 4.60953929e+00 1.12897294e+02
1716.lowfreq: -7.9963 -0.0007 0.0005 0.0007 0.5386 6.2727 7.8235 18.2040 29.7460
frequency: 6.1036 17.9611 29.7374 38.9417 48.7982 57.5500 71.7526 97.8985 107.4332 123.1335 143.6942 150.6857 170.9508 198.5132 227.9978 242.7600 255.0815 264.1369 290.0446 330.6556 346.8062 385.1419 424.3952 439.9466 471.0071 559.7539 597.0564 673.4155 695.7582 746.1028 754.0351 791.2192 797.2266 799.6040 814.2237 818.8164 908.2933 921.2952 954.5927 977.2995 1019.4881 1023.5766 1033.3099 1050.0674 1094.6634 1111.8074 1113.1957 1123.4197 1134.2997 1134.9827 1137.9396 1177.8636 1193.4020 1229.0698 1248.3332 1248.8721 1273.7417 1301.5109 1322.4655 1352.9271 1358.2195 1370.2829 1377.3156 1400.3257 1400.5753 1446.4825 1450.3616 1452.5476 1461.4981 1463.4752 1463.9819 1473.1555 1474.1102 1486.0450 1487.0083 1621.1045 1633.3194 1636.4071 2983.3336 2989.9823 2995.4846 2996.4378 2997.2453 3008.5695 3012.4427 3021.1284 3066.8973 3068.8880 3069.0424 3071.7250 3089.4764 3092.0354 3094.1378 3107.5174 3109.7908 3123.6649
redmass: 3.5901 4.3695 3.9909 3.7308 3.1252 3.0329 4.7576 2.9753 3.2351 3.7235 1.1353 2.2004 2.6668 3.4507 3.3550 1.5711 1.3780 2.1965 4.0831 4.4550 3.9136 4.2759 3.5932 3.9178 3.3342 2.9063 4.1198 4.7123 4.7310 2.7059 4.9990 2.0470 1.1089 1.1134 3.5496 3.1911 3.0255 4.6830 2.3055 1.8098 2.2178 2.2789 2.3865 2.3152 3.8000 2.3590 2.2586 2.6126 1.7681 1.4803 2.1100 1.4528 1.5347 2.1585 1.1424 1.1370 1.3497 1.4606 1.3815 1.3597 1.4478 1.2430 1.5851 1.2624 1.2717 1.0721 1.0575 1.0792 1.0904 1.0402 1.0401 1.0644 1.0608 1.0657 1.0682 9.3853 9.1122 8.9337 1.0390 1.0773 1.0359 1.0661 1.0360 1.0581 1.0581 1.0608 1.1067 1.0963 1.0964 1.1067 1.1001 1.0985 1.0986 1.1025 1.1027 1.1004
irintensity: 0.6259 1.5510 0.2361 3.6702 1.6992 0.7995 3.1026 0.3351 0.7922 0.5798 0.4782 5.4287 6.2100 10.5120 10.0136 0.6035 3.4397 0.6339 2.4363 13.6781 6.9969 2.2534 7.6142 17.9663 2.7815 3.9286 2.9725 0.5496 2.7288 21.8968 7.2925 5.1458 3.6562 2.7503 3.6816 1.4326 13.8615 22.7939 5.1005 16.1833 46.9935 42.0132 48.4750 79.3688 174.7178 5.1830 9.1493 132.6473 142.1997 6.8625 213.9841 43.1987 88.5912 33.6245 0.3878 0.2270 55.4175 78.1397 106.5400 1.5447 9.1183 71.4322 13.2018 29.9621 8.9993 32.1790 23.7793 11.6643 36.0474 11.4469 14.1739 4.6100 4.2647 14.2982 13.8881 110.8751 112.1717 199.4901 1.2515 9.9669 21.6025 10.1331 18.4881 19.5362 16.0303 14.1040 9.2920 7.1745 1.6087 7.0548 7.2462 31.2646 26.8108 43.9723 40.8488 12.9671
temp: 298.150 k
press: 1.00000 atm
elementType: 8 8 8 8 8 6 6 6 6 6 6 6 6 6 6 6 1 1 1 1 1 1 1 1 1 1 1 1 1 1 1 1 1 1
symmnumber: 1
zpe: 726305.3 jmol-1
zpe.correction: 0.276635 hartree
zpe.thermalcorrener: 0.296235 hartree
zpe.thermalcorrenthalpy: 0.297180 hartree
zpe.thermalcorrgfe: 0.223303 hartree
zpe.sumelectzpe: -804.828710 hartree
zpe.sumelectthermal: -804.809110 hartree
zpe.sumelectthermalent: -804.808165 hartree
zpe.sumelectthermalfe: -804.882042 hartree
dipole: 2.5730 -1.6658 0.8548
dipole: 3.1821
quadrupole: -70.1174 -98.2480 -101.6177
quadrupole: -0.0947 -2.7229 -2.7505
quadrupole: 19.8769 -8.2536 -11.6233 -0.0947 -2.7229 -2.7505
hfenergy: -805.105345 hartree
pointgroup: C01 [X(C11H18O5)]
dipole: -1.0226316 0.678289 0.2479791 debye
polarizability: 160.4596032|-9.3300929|132.5116968|6.069152|-5.0501593|113.3642708 unknown
InChI: InChI=1S/C11H18O5/c1-4-15-10(13)7-6-9(8(3)12)11(14)16-5-2/h9H,4-7H2,1-3H3
charge 0 multiplicity 1
34 atoms
O  -2.61767 1.081804 -0.695968
O  3.572037 0.092181 0.556303
O  -0.188853 -3.00636 -0.872033
O  -1.640563 0.169585 1.212767
O  2.75188 1.363332 -1.214426
C  -1.093382 -0.745315 -1.027194
C  0.357053 -0.255959 -1.312742
C  1.294231 -0.296595 -0.088122
C  -1.149602 -2.238796 -0.610855
C  -1.793429 0.17393 -0.033243
C  2.57609 0.477844 -0.343188
C  -2.41475 -2.733636 0.067556
C  -3.297893 2.10862 0.160485
C  4.876999 0.815815 0.443581
C  -4.078039 3.019217 -0.780882
C  5.797719 0.228002 1.507944
H  -1.659065 -0.674866 -1.97937
H  0.321801 0.770856 -1.71854
H  0.771047 -0.90637 -2.103577
H  1.550196 -1.33337 0.186859
H  0.805314 0.148897 0.801073
H  -2.4061 -2.40542 1.124582
H  -3.3194 -2.300249 -0.397758
H  -2.457436 -3.833012 0.033239
H  -3.948366 1.579021 0.879846
H  -2.520996 2.648561 0.730902
H  4.690206 1.895113 0.591544
H  5.265248 0.672518 -0.581065
H  -4.597026 3.801379 -0.197507
H  -3.403087 3.513495 -1.499971
H  -4.834593 2.449811 -1.347269
H  6.783308 0.726993 1.468333
H  5.375329 0.371198 2.517191
H  5.947892 -0.852822 1.344703
