program: Orca
programVersion: 5.0.2
elementType: S F F F O O O N N N N N C C C C C C C C C C C C H H H H H H H H
charge: 0
multiplicity: 1
keywords: wb97x-d3
keywords: def2-TZVPP
keywords: def2/J RIJCOSX
keywords: DEFGRID2
keywords: scfconv7
keywords: smallprint printgap noloewdin
keywords: NOSOSCF
formula: C12H8F3N5O3S
InChI: InChI=1/C12H8F3N5O3S/c1-23-12-16-5-8(15)10-17-11(18-20(10)12)24(21,22)19-9-6(13)3-2-4-7(9)14/h2-5,19H,1H3
32 atoms
S  1.01336 1.620997 0.968549
F  -2.588886 -2.538112 2.439183
F  0.760287 -0.582401 -1.946458
F  4.402833 1.191429 0.37215
O  1.784377 0.934964 1.977892
O  0.612029 3.002326 1.106595
O  -3.491977 0.630269 -1.784151
N  -2.236896 0.018139 -0.030402
N  1.824573 1.501353 -0.454258
N  -1.292646 0.939988 -0.223733
N  -0.785203 -0.348535 1.567303
N  -4.1955 -1.113011 -0.455468
C  -0.470975 0.660566 0.75395
C  -1.92839 -0.752963 1.055146
C  2.549538 0.333484 -0.757675
C  -3.36756 -0.183428 -0.773963
C  -2.845895 -1.766778 1.388687
C  2.014336 -0.707946 -1.507714
C  3.861012 0.191701 -0.317723
C  -3.951175 -1.906126 0.617838
C  2.733307 -1.844291 -1.812505
C  4.609163 -0.935337 -0.587191
C  4.03235 -1.949166 -1.337522
C  -4.660848 0.501037 -2.601264
H  1.444275 2.04998 -1.2207
H  -4.686777 -2.67066 0.83387
H  2.285208 -2.631669 -2.403546
H  5.624611 -1.015024 -0.223212
H  4.608417 -2.836752 -1.560888
H  -5.564792 0.685363 -2.021957
H  -4.711605 -0.485185 -3.060901
H  -4.559584 1.259083 -3.372044
elementType: S F O N C H
totalener: -1659.35369151 hartree
nucrepener: 2353.64011127 hartree
electener: -4012.99380279 hartree
oneelecener: -6959.06858424 hartree
twoeener: 2946.07478146 hartree
cpcmener: -0.03966218 hartree
kineticenergy: 1653.85156077 hartree
xcener: -131.105038020634 hartree
chargesum: -0.0000000
charge: 0.870055 -0.194642 -0.204091 -0.197875 -0.481040 -0.492851 -0.271913 0.166314 -0.222823 -0.309777 -0.332581 -0.393910 0.106846 0.194448 0.053909 0.440129 0.172665 0.215483 0.235762 0.015523 -0.172339 -0.166623 -0.118782 -0.112053 0.205233 0.148776 0.153173 0.151864 0.165293 0.120862 0.120156 0.134810
qa: 0.8701 -0.1946 -0.2041 -0.1979 -0.4810 -0.4929 -0.2719 0.1663 -0.2228 -0.3098 -0.3326 -0.3939 0.1068 0.1944 0.0539 0.4401 0.1727 0.2155 0.2358 0.0155 -0.1723 -0.1666 -0.1188 -0.1121 0.2052 0.1488 0.1532 0.1519 0.1653 0.1209 0.1202 0.1348
va: 5.8638 1.1023 1.0909 1.1001 2.0166 2.0078 2.1702 3.4387 3.0341 2.8917 3.0994 3.0414 4.1266 3.9449 3.5740 4.1384 3.9727 4.0476 4.0847 3.9974 3.9173 3.8915 3.8538 3.8310 1.0066 0.9961 0.9978 0.9985 0.9855 0.9965 0.9960 0.9925
dispcorr: -0.015572558 hartree
energy: -1659.369264071886
dipole: -7.62478 5.85084 -1.77394 -3.43305 1.32688 -2.10617 -12.90144 9.48744 -3.41399
magnitude: 4.38613 au
magnitude: 11.14866 debye
