program: Orca
programVersion: 5.0.2
elementType: S F F F O O O N N N N N C C C C C C C C C C C C H H H H H H H H
charge: 0
multiplicity: 1
keywords: wb97x-d3
keywords: def2-TZVPP
keywords: def2/J RIJCOSX
keywords: DEFGRID2
keywords: scfconv7
keywords: smallprint printgap noloewdin
keywords: NOSOSCF
formula: C12H8F3N5O3S
InChI: InChI=1/C12H8F3N5O3S/c1-23-12-16-5-8(15)10-17-11(18-20(10)12)24(21,22)19-9-6(13)3-2-4-7(9)14/h2-5,19H,1H3
32 atoms
S  1.010764 1.835039 -0.105751
F  -3.245573 -0.386712 -3.133255
F  4.314648 1.168605 0.683828
F  1.089992 -1.689353 -1.10865
O  1.368315 1.870495 1.292918
O  0.868534 3.031832 -0.902252
O  -3.249428 -0.511899 2.222129
N  -2.272557 0.038772 0.279449
N  2.093639 0.876919 -0.879517
N  -1.193589 0.596972 0.836617
N  -1.079865 0.722427 -1.422575
N  -4.313631 -1.025491 0.248257
C  -0.539419 0.97742 -0.227718
C  -2.196129 0.117141 -1.084395
C  2.680355 -0.225253 -0.231569
C  -3.337221 -0.531374 0.922355
C  -3.273511 -0.432534 -1.805876
C  3.819149 -0.058596 0.548549
C  2.185606 -1.517092 -0.36733
C  -4.294537 -0.98361 -1.107621
C  4.446481 -1.119352 1.16828
C  2.790977 -2.606454 0.222019
C  3.924144 -2.392283 0.992978
C  -4.340162 -1.066502 2.96659
H  2.00985 0.85478 -1.892156
H  -5.145291 -1.416083 -1.619232
H  5.33133 -0.954347 1.768052
H  2.382768 -3.598663 0.084277
H  4.409661 -3.234534 1.466684
H  -4.071226 -0.939997 4.010747
H  -4.467435 -2.125373 2.744783
H  -5.266469 -0.53235 2.75841
elementType: S F O N C H
totalener: -1659.35535387 hartree
nucrepener: 2344.30094255 hartree
electener: -4003.65629641 hartree
oneelecener: -6940.45043776 hartree
twoeener: 2936.79414135 hartree
cpcmener: -0.03894903 hartree
kineticenergy: 1653.84934943 hartree
xcener: -131.105302839684 hartree
chargesum: 0.0000000
charge: 0.866990 -0.195467 -0.198089 -0.203404 -0.484274 -0.492486 -0.270186 0.171890 -0.222661 -0.287633 -0.357081 -0.395190 0.112847 0.184863 0.049330 0.441120 0.174579 0.241449 0.222385 0.016399 -0.171864 -0.178437 -0.112230 -0.111744 0.205375 0.147715 0.151833 0.153276 0.164907 0.135369 0.120122 0.120298
qa: 0.8670 -0.1955 -0.1981 -0.2034 -0.4843 -0.4925 -0.2702 0.1719 -0.2227 -0.2876 -0.3571 -0.3952 0.1128 0.1849 0.0493 0.4411 0.1746 0.2414 0.2224 0.0164 -0.1719 -0.1784 -0.1122 -0.1117 0.2054 0.1477 0.1518 0.1533 0.1649 0.1354 0.1201 0.1203
va: 5.8738 1.1006 1.1000 1.0923 2.0099 2.0117 2.1722 3.4074 3.0320 2.8996 3.0761 3.0396 4.1254 3.9696 3.5775 4.1393 3.9707 4.0795 4.0435 3.9979 3.8980 3.9230 3.8479 3.8304 1.0067 0.9965 0.9988 0.9981 0.9856 0.9925 0.9962 0.9965
dispcorr: -0.015370194 hartree
energy: -1659.370724060578
dipole: -6.33557 4.91817 -1.41740 -10.32967 6.66537 -3.66430 12.19724 -11.71785 0.47939
magnitude: 3.95802 au
magnitude: 10.06049 debye
