program: Gaussian 09
title: 000068891
version: EM64L-G09RevD.01
frameworkgroup: C1[X(C19H15Cl3N2O2)]
method: RPBEPBE
basis: SDD
operation: Freq
keyword: #p
keyword: freq=noraman
keyword: PBEPBE/SDD
title: #p freq=noraman PBEPBE/SDD
converged: YES YES NO NO
title: Mulliken charges:
elementType: Cl Cl Cl O O N N C C C C C C C C C C C C C C C C C C C H H H H H H H H H H H H H H H
charge: -0.018588 -0.026394 -0.061935 -0.296514 -0.273662 -0.150218 -0.083769 0.264534 0.402529 -0.303800 -0.300067 -0.234131 -0.317115 -0.359748 0.368732 -0.204090 -0.223080 -0.106750 -0.166594 -0.205568 -0.324591 -0.358329 -0.332463 -0.203789 -0.183550 -0.118077 0.232978 0.242234 0.232417 0.218277 0.245669 0.266924 0.287635 0.265463 0.289619 0.257135 0.254525 0.256582 0.255173 0.254700 0.257695
chargesum: 0.00000
title: Mulliken charges with hydrogens summed into heavy atoms:
elementType: Cl Cl Cl O O N N C C C C C C C C C C C C C C C C C C C
charge: -0.018588 -0.026394 -0.061935 -0.296514 -0.273662 -0.150218 -0.083769 0.264534 0.402529 0.171413 0.150626 0.011538 -0.317115 -0.092823 0.368732 0.083544 0.042383 -0.106750 0.123025 0.051567 -0.070067 -0.101747 -0.077290 0.050910 0.074146 -0.118077
polarizability: 3.15277970e+02 -1.38888224e+01 3.34416124e+02 -3.62417566e+01 1.64407017e+01 1.66980682e+02
1716.lowfreq: -3.0061 0.0019 0.0020 0.0023 1.3238 5.3608 9.0644 19.2166 23.8283
frequency: 8.6660 19.2071 23.8003 36.0125 39.1701 40.2053 45.5904 75.6122 100.6885 115.9498 126.1117 131.3950 148.2781 161.6978 166.9046 173.9332 202.3521 209.4023 225.3812 279.9546 301.5755 316.9400 329.9790 350.1244 372.0519 395.3085 415.6178 415.9700 439.0818 457.9147 480.2640 498.8291 532.4401 563.6338 611.4611 621.6870 626.9001 638.4573 648.0482 653.8852 696.5390 700.0189 730.1483 737.6004 772.9007 778.0330 785.3398 800.8411 817.5918 823.1449 823.6379 836.8039 840.8776 857.8231 870.7491 872.7560 929.7126 953.2223 958.2146 962.4884 991.1026 993.0059 999.2021 1020.4335 1047.1102 1066.4428 1071.6441 1085.5247 1104.6200 1106.4155 1109.4370 1114.1805 1139.5414 1175.3254 1178.0659 1188.8381 1223.8144 1231.6947 1245.9127 1268.4155 1274.1135 1288.8485 1290.7208 1322.7816 1332.9839 1353.3704 1370.1110 1376.0767 1381.2961 1403.4198 1404.8425 1447.6850 1461.1904 1471.2544 1479.9733 1480.0346 1490.9471 1554.1511 1586.4384 1586.9488 1605.0090 1676.3134 2973.7787 3003.8259 3037.4420 3080.1693 3151.7945 3157.3189 3159.6149 3170.7313 3175.8090 3179.8993 3180.1312 3182.9649 3228.6501 3236.2232 3289.4120
redmass: 9.8481 6.6081 5.6266 8.7652 5.8691 8.0088 5.2038 7.5688 6.0339 4.9901 6.3989 2.2265 4.7056 6.7160 12.4522 7.5770 6.4965 9.4257 7.6978 6.1155 6.3528 7.1351 7.1229 5.8203 9.8868 5.6947 7.3605 3.0340 4.8244 4.2950 5.3387 2.7193 5.4013 5.1335 4.4250 6.4830 4.1987 6.1841 3.2121 6.0692 3.5062 6.3681 4.5086 1.3990 6.0651 1.3514 5.3718 1.2813 5.4781 1.4312 1.4733 1.1861 1.4068 1.4091 1.4011 6.3733 1.3354 1.3428 7.0124 1.3566 3.9317 6.5008 4.5758 4.7864 1.8801 3.5524 2.5898 2.5832 1.6885 1.7667 1.3209 2.4062 1.4227 1.1695 1.1214 2.6874 4.2670 1.5323 1.4487 1.1426 1.9832 2.4922 1.4023 1.5507 2.2665 3.4978 4.9449 3.3542 3.1426 1.8854 2.6344 2.8043 3.1433 1.8845 1.2144 4.1025 1.1334 8.1856 7.3882 7.3329 6.6728 7.9987 1.0558 1.0572 1.1061 1.1089 1.0895 1.0879 1.0885 1.0906 1.0967 1.0957 1.0979 1.0943 1.0966 1.0966 1.1040
irintensity: 0.0379 0.1859 0.3330 1.1175 0.3219 0.8306 0.3148 0.6521 0.3594 0.1673 5.6792 0.4064 8.0851 3.6483 0.4647 5.6546 1.5426 0.5189 5.7395 1.1059 4.9481 2.0055 1.6310 5.8498 7.8599 3.3765 3.6821 0.0700 2.4211 12.3574 6.9482 23.4091 17.3319 15.1176 11.3645 2.9467 17.5319 27.8369 27.1843 3.8956 0.2974 16.8862 12.3511 0.1695 2.6727 76.9002 50.8919 15.9651 12.9901 18.8956 87.8202 12.7914 11.3711 0.0519 18.7950 7.8042 0.0020 0.3064 10.7986 0.0059 36.2995 6.7149 156.7909 76.0928 33.2774 192.7308 46.9815 45.0151 1.7549 23.8398 13.2757 18.8758 1.9220 47.0342 6.8648 85.5836 335.0045 19.5848 7.6690 0.5479 116.9322 57.0127 5.3545 7.0698 6.0239 48.9571 4.8373 3.7110 24.9573 10.7658 8.3666 240.7795 25.6848 231.4928 39.5867 4.6583 0.9620 28.8886 37.2129 34.8707 25.4048 85.0437 24.8191 39.2909 10.9306 36.8818 3.2371 10.2195 1.6340 14.4778 7.2032 0.5596 1.1083 1.4027 1.8261 4.6890 8.1513
temp: 298.150 k
press: 1.00000 atm
elementType: 17 17 17 8 8 7 7 6 6 6 6 6 6 6 6 6 6 6 6 6 6 6 6 6 6 6 1 1 1 1 1 1 1 1 1 1 1 1 1 1 1
symmnumber: 1
zpe: 776112.8 jmol-1
zpe.correction: 0.295606 hartree
zpe.thermalcorrener: 0.319869 hartree
zpe.thermalcorrenthalpy: 0.320813 hartree
zpe.thermalcorrgfe: 0.235782 hartree
zpe.sumelectzpe: -2371.247879 hartree
zpe.sumelectthermal: -2371.223616 hartree
zpe.sumelectthermalent: -2371.222672 hartree
zpe.sumelectthermalfe: -2371.307703 hartree
dipole: 1.9741 -3.0434 -1.2528
dipole: 3.8378
quadrupole: -186.3786 -202.4719 -169.5444
quadrupole: -14.8270 -6.2270 4.5921
quadrupole: -0.2470 -16.3403 16.5873 -14.8270 -6.2270 4.5921
hfenergy: -2371.5434846 hartree
pointgroup: C01 [X(C19H15Cl3N2O2)]
dipole: -0.9087689 -1.0313711 0.6246663 debye
polarizability: 311.7660622|12.9132277|328.2172605|-52.4828019|-18.4838245|176.6914539 unknown
InChI: InChI=1S/C19H15Cl3N2O2/c20-14-1-4-16(5-2-14)25-9-10-26-19(12-24-8-7-23-13-24)17-6-3-15(21)11-18(17)22/h1-8,11-13H,9-10H2
charge 0 multiplicity 1
41 atoms
Cl -1.752286 -1.311456 -2.200649
Cl -5.284793 -4.160726 0.947891
Cl 8.131412 -2.357599 -0.958149
O  -0.534683 0.836763 -0.189661
O  2.39902 -1.220978 0.529975
N  -1.940636 3.40772 0.049889
N  -1.869341 5.685557 0.091675
C  -1.913739 0.90964 0.098487
C  -2.708148 -0.339986 0.271663
C  0.252544 -0.20356 0.510358
C  1.619646 -0.19381 -0.171252
C  -2.528718 2.130545 0.157088
C  -2.715352 -1.415429 -0.657701
C  -3.533162 -0.486053 1.423299
C  3.727818 -1.424408 0.120027
C  -3.48587 -2.578563 -0.468233
C  -4.329097 -1.629406 1.63887
C  -4.286199 -2.666413 0.687332
C  -0.608593 3.779474 -0.236111
C  -2.655328 4.610538 0.234777
C  4.357771 -0.715931 -0.932397
C  4.437965 -2.416035 0.841258
C  -0.589222 5.171424 -0.204704
C  5.703796 -1.003231 -1.25952
C  5.777448 -2.702029 0.51504
C  6.394823 -1.989035 -0.534387
H  0.33978 0.051725 1.58291
H  -0.217661 -1.197259 0.406995
H  1.512244 -0.442043 -1.24518
H  2.103788 0.797962 -0.069497
H  -3.616137 2.152522 0.266239
H  -3.529133 0.315273 2.169353
H  -3.471836 -3.382136 -1.20841
H  -4.954304 -1.717029 2.531113
H  0.151096 3.035421 -0.442393
H  -3.717808 4.623754 0.468711
H  3.827203 0.050739 -1.503878
H  3.929981 -2.950239 1.649388
H  0.253429 5.836054 -0.379054
H  6.199763 -0.46163 -2.070133
H  6.331321 -3.465825 1.068072
