program: Orca
programVersion: 5.0.2
elementType: S F F F O O O N N N N N C C C C C C C C C C C C H H H H H H H H
charge: 0
multiplicity: 1
keywords: wb97x-d3
keywords: def2-TZVPP
keywords: def2/J RIJCOSX
keywords: DEFGRID2
keywords: scfconv7
keywords: smallprint printgap noloewdin
keywords: NOSOSCF
formula: C12H8F3N5O3S
InChI: InChI=1/C12H8F3N5O3S/c1-23-12-16-5-8(15)10-17-11(18-20(10)12)24(21,22)19-9-6(13)3-2-4-7(9)14/h2-5,19H,1H3
32 atoms
S  1.051987 1.957383 -0.136175
F  -3.170707 -0.425073 -3.127963
F  4.340808 1.100203 0.633857
F  0.935095 -1.576686 -1.104528
O  1.440938 1.997773 1.246494
O  0.911676 3.12052 -0.969882
O  -3.139184 -0.53392 2.230341
N  -2.191209 0.063476 0.28096
N  2.097273 0.933544 -0.919479
N  -1.130744 0.664785 0.830415
N  -1.039984 0.79831 -1.42942
N  -4.180627 -1.099617 0.263173
C  -0.494869 1.078369 -0.235518
C  -2.123819 0.145316 -1.089915
C  2.612739 -0.192497 -0.255778
C  -3.224954 -0.555666 0.92725
C  -3.181288 -0.461228 -1.803677
C  3.755383 -0.081377 0.530695
C  2.033966 -1.452824 -0.357211
C  -4.167669 -1.060301 -1.094242
C  4.299377 -1.168238 1.187334
C  2.558101 -2.564608 0.267895
C  3.694599 -2.406628 1.046199
C  -4.198754 -1.146774 2.958227
H  1.94034 0.869951 -1.91764
H  -4.9983 -1.537129 -1.598604
H  5.186818 -1.041059 1.791121
H  2.081365 -3.527707 0.151179
H  4.116657 -3.265001 1.550212
H  -3.941491 -1.020627 4.005055
H  -4.281135 -2.206727 2.719576
H  -5.15239 -0.662894 2.748725
totalener: -1659.32848239 hartree
nucrepener: 2357.81741345 hartree
electener: -4017.14589584 hartree
oneelecener: -6966.78372682 hartree
twoeener: 2949.63783098 hartree
kineticenergy: 1653.87539359 hartree
xcener: -131.101073776941 hartree
chargesum: -0.0000000
charge: 0.845847 -0.172446 -0.170711 -0.194369 -0.419893 -0.429246 -0.237899 0.157442 -0.209775 -0.249599 -0.303338 -0.365393 0.085736 0.144206 0.012341 0.395693 0.174102 0.243746 0.203133 -0.016848 -0.149735 -0.158640 -0.094680 -0.121052 0.164806 0.125353 0.126356 0.126434 0.132865 0.131202 0.111316 0.113046
qa: 0.8458 -0.1724 -0.1707 -0.1944 -0.4199 -0.4292 -0.2379 0.1574 -0.2098 -0.2496 -0.3033 -0.3654 0.0857 0.1442 0.0123 0.3957 0.1741 0.2437 0.2031 -0.0168 -0.1497 -0.1586 -0.0947 -0.1211 0.1648 0.1254 0.1264 0.1264 0.1329 0.1312 0.1113 0.1130
va: 5.8993 1.1306 1.1410 1.1026 2.0816 2.0866 2.1887 3.3599 3.0416 2.8344 3.0768 3.0513 4.0925 3.9564 3.6656 4.1594 3.9869 4.1210 4.0605 4.0140 3.9277 3.9511 3.8934 3.8564 1.0365 1.0033 1.0080 1.0071 0.9970 0.9922 0.9986 0.9986
dispcorr: -0.015725394 hartree
energy: -1659.344207780420
dipole: -6.55896 5.45411 -1.10485 -10.86451 8.18633 -2.67818 12.39126 -11.79707 0.59419
magnitude: 2.95743 au
magnitude: 7.51719 debye
