program: Orca
programVersion: 5.0.2
elementType: S F F F O O O N N N N N C C C C C C C C C C C C H H H H H H H H
charge: 0
multiplicity: 1
keywords: wb97x-d3
keywords: def2-TZVPP
keywords: def2/J RIJCOSX
keywords: DEFGRID2
keywords: scfconv7
keywords: smallprint printgap noloewdin
keywords: NOSOSCF
formula: C12H8F3N5O3S
InChI: InChI=1/C12H8F3N5O3S/c1-23-12-16-5-8(15)10-17-11(18-20(10)12)24(21,22)19-9-6(13)3-2-4-7(9)14/h2-5,19H,1H3
32 atoms
S  0.720823 0.717711 -1.887982
F  -2.829134 -3.395719 -0.156114
F  1.472221 -1.718111 0.86034
F  4.014419 1.49543 -1.382067
O  1.066752 2.028241 -1.409986
O  0.377731 0.417953 -3.252033
O  -3.333066 1.652481 1.572741
N  -2.259078 0.102987 0.348586
N  1.95624 -0.310825 -1.476458
N  -1.334619 0.938254 -0.135809
N  -1.033221 -1.148945 -0.962927
N  -4.099256 -0.512324 1.591182
C  -0.645391 0.13449 -0.904188
C  -2.064543 -1.161489 -0.15407
C  2.692181 -0.09913 -0.299212
C  -3.281125 0.400144 1.207457
C  -2.97028 -2.153693 0.283154
C  2.447997 -0.807877 0.872011
C  3.728337 0.83077 -0.274077
C  -3.952092 -1.785069 1.140669
C  3.184151 -0.617397 2.022643
C  4.47389 1.062071 0.86501
C  4.194425 0.331718 2.008673
C  -4.384331 2.029012 2.456144
H  1.815165 -1.264594 -1.78563
H  -4.670813 -2.509496 1.501475
H  2.964056 -1.196948 2.908105
H  5.266954 1.79624 0.846075
H  4.776843 0.501328 2.903422
H  -4.316457 1.492465 3.402057
H  -5.360761 1.838919 2.011446
H  -4.254264 3.093551 2.623123
totalener: -1659.32857572 hartree
nucrepener: 2344.75240562 hartree
electener: -4004.08098134 hartree
oneelecener: -6940.68897347 hartree
twoeener: 2936.60799213 hartree
kineticenergy: 1653.87338375 hartree
xcener: -131.100809715560 hartree
chargesum: -0.0000000
charge: 0.847690 -0.172475 -0.192293 -0.171400 -0.419142 -0.430517 -0.237245 0.150262 -0.210114 -0.255046 -0.315351 -0.364671 0.105216 0.149747 0.013472 0.396239 0.174503 0.200791 0.239331 -0.016798 -0.156631 -0.148662 -0.098222 -0.121022 0.164099 0.125536 0.127192 0.126433 0.133195 0.111624 0.113019 0.131239
qa: 0.8477 -0.1725 -0.1923 -0.1714 -0.4191 -0.4305 -0.2372 0.1503 -0.2101 -0.2550 -0.3154 -0.3647 0.1052 0.1497 0.0135 0.3962 0.1745 0.2008 0.2393 -0.0168 -0.1566 -0.1487 -0.0982 -0.1210 0.1641 0.1255 0.1272 0.1264 0.1332 0.1116 0.1130 0.1312
va: 5.8934 1.1304 1.1041 1.1407 2.0818 2.0808 2.1895 3.3675 3.0511 2.8511 3.0702 3.0523 4.0852 3.9534 3.6623 4.1610 3.9855 4.0602 4.1177 4.0141 3.9455 3.9273 3.8952 3.8563 1.0376 1.0032 1.0069 1.0080 0.9970 0.9983 0.9986 0.9922
dispcorr: -0.015392010 hartree
energy: -1659.343967732367
dipole: -5.90632 5.14302 -0.76330 7.05909 -7.60933 -0.55023 14.23784 -11.60588 2.63196
magnitude: 2.79510 au
magnitude: 7.10459 debye
