program: Gaussian 09
title: 000007558
version: EM64L-G09RevD.01
frameworkgroup: C1[X(C10H21N)]
method: RPBEPBE
basis: SDD
operation: Freq
keyword: #pfreq=noraman
keyword: PBEPBE/SDD
title: #p freq=noraman PBEPBE/SDD
converged: YES YES NO NO
title: Mulliken charges:
elementType: N C C C C C C C C C C H H H H H H H H H H H H H H H H H H H H H
charge: -0.311241 0.071292 -0.451768 -0.454022 -0.495794 -0.401564 -0.400849 -0.382620 -0.055398 -0.723051 -0.628965 0.229364 0.181974 0.196961 0.192780 0.185257 0.192730 0.187394 0.192453 0.192316 0.192217 0.192101 0.195866 0.185005 0.203712 0.216327 0.202530 0.217394 0.244155 0.189228 0.222028 0.222187
chargesum: 0.00000
title: Mulliken charges with hydrogens summed into heavy atoms:
elementType: N C C C C C C C C C C
charge: -0.067086 0.300656 -0.072833 -0.075985 -0.115669 -0.016795 -0.016531 -0.001749 0.148314 -0.086801 0.004478
polarizability: 1.30214270e+02 3.06963450e-01 1.06014306e+02 -1.23733586e+00 1.15820707e-01 1.02320256e+02
1716.lowfreq: -28.0329 -12.1976 0.0001 0.0003 0.0005 7.8401 22.3255 57.2956 79.9910
frequency: 13.5059 57.0651 79.9642 118.0595 154.5295 209.4581 210.8490 223.1287 251.6657 286.1018 308.2797 315.7684 408.6895 415.7956 432.6782 462.1614 510.5196 549.5420 631.8060 769.3673 781.8613 814.9800 839.7238 848.3857 885.3701 899.1938 913.6201 919.3372 968.8157 1000.1284 1036.7773 1048.3342 1056.0456 1060.2658 1094.9220 1102.1140 1107.4895 1115.4963 1128.9477 1145.3834 1173.4095 1195.1184 1229.3099 1249.7878 1256.8502 1265.2810 1271.1128 1296.8445 1311.7056 1332.1597 1332.6612 1333.5395 1337.4196 1341.5782 1352.2963 1358.9220 1374.9987 1432.0211 1439.2097 1453.5597 1458.6262 1461.0541 1461.9606 1464.1825 1467.0953 1472.6933 1474.8915 1481.1307 1495.8491 2878.3369 2937.0670 2943.5431 2946.2086 2960.9529 2962.6428 2963.7218 2964.2072 2968.6174 2976.7967 3002.6732 3008.9385 3011.3555 3019.5890 3022.1243 3023.5765 3037.0785 3060.0311 3066.7066 3068.1706 3432.6846
redmass: 2.8223 3.1456 2.1035 2.4335 2.1842 1.2306 1.7309 1.2280 2.2625 3.2888 2.1631 1.7724 2.0444 2.3401 2.7580 1.9191 2.8294 1.7592 1.6842 2.3222 1.5313 1.5947 2.3615 1.5858 1.7689 1.4821 1.6886 1.8031 2.3538 1.6470 2.0759 1.8106 1.2702 1.1883 1.7273 1.9127 1.6932 2.2626 1.9083 2.2607 2.3489 1.6639 1.6079 1.2772 1.2569 1.3641 1.2489 1.2841 1.2714 1.3795 1.4879 1.2835 1.4815 1.5056 1.4872 1.4764 1.2221 1.1292 1.1580 1.0921 1.0862 1.0893 1.0894 1.0634 1.0806 1.0961 1.0974 1.0587 1.0418 1.0553 1.0619 1.0622 1.0651 1.0596 1.0624 1.0520 1.0507 1.0797 1.0823 1.0981 1.0750 1.0958 1.0988 1.0940 1.1025 1.1034 1.0991 1.0995 1.0993 1.0740
irintensity: 0.0626 0.5026 1.0988 0.5693 0.2946 1.0264 0.2479 0.3758 2.7711 2.0984 0.4017 0.7912 1.6050 1.2775 0.4263 3.8604 3.0531 12.4347 109.9312 0.3030 0.0616 6.3789 10.0628 5.0205 7.7047 4.5240 3.0517 1.8292 9.8966 18.2648 1.8750 0.6372 1.6339 3.7701 1.8657 3.6639 2.7267 0.4768 7.2371 42.1068 23.7541 0.6563 2.1198 5.1607 1.7472 2.0659 3.2579 2.3110 2.0313 0.4008 1.7261 7.6161 0.8616 0.7507 1.5035 1.1784 19.5753 1.8322 23.6177 3.3870 0.2506 8.0633 7.3601 8.6464 19.4400 5.1981 2.5585 10.7158 15.0864 149.5587 13.3458 31.0945 44.2940 33.9189 33.6376 75.4111 1.4197 7.9095 37.5693 7.2348 44.8906 121.6443 56.0490 52.2293 16.1124 148.7594 48.7938 64.4498 31.7444 1.6292
temp: 298.150 k
press: 1.00000 atm
elementType: 7 6 6 6 6 6 6 6 6 6 6 1 1 1 1 1 1 1 1 1 1 1 1 1 1 1 1 1 1 1 1 1
symmnumber: 1
zpe: 771629.7 jmol-1
zpe.correction: 0.293898 hartree
zpe.thermalcorrener: 0.306801 hartree
zpe.thermalcorrenthalpy: 0.307745 hartree
zpe.thermalcorrgfe: 0.253786 hartree
zpe.sumelectzpe: -447.481758 hartree
zpe.sumelectthermal: -447.468856 hartree
zpe.sumelectthermalent: -447.467912 hartree
zpe.sumelectthermalfe: -447.521871 hartree
dipole: -0.9933 -0.3188 -0.0106
dipole: 1.0433
quadrupole: -69.2134 -71.4215 -70.1703
quadrupole: -0.5286 1.6128 0.6702
quadrupole: 1.0550 -1.1531 0.0981 -0.5286 1.6128 0.6702
hfenergy: -447.7756566 hartree
pointgroup: C01 [X(C10H21N1)]
dipole: -0.3885144 -0.1319458 0.0107434 debye
polarizability: 130.230868|0.5775749|105.9680546|-0.8755059|-0.4947246|102.3499097 unknown
InChI: InChI=1S/C10H21N/c1-9(11-2)8-10-6-4-3-5-7-10/h9-11H,3-8H2,1-2H3
charge 0 multiplicity 1
32 atoms
N  -2.389899 0.332862 -0.940668
C  0.500203 -0.268171 -0.104265
C  1.004046 0.633118 1.054367
C  1.638814 -1.21489 -0.565769
C  -0.764209 -1.071249 0.285718
C  2.281646 1.416398 0.666286
C  2.920689 -0.441923 -0.95775
C  3.407049 0.462639 0.199331
C  -2.063544 -0.233019 0.393878
C  -3.208675 -1.077762 1.019452
C  -3.430874 1.375584 -0.98067
H  0.220909 0.387897 -0.955529
H  1.222823 -0.006677 1.937185
H  0.211425 1.343313 1.361762
H  1.290331 -1.827694 -1.421836
H  1.877578 -1.923636 0.256898
H  -0.591752 -1.588064 1.25281
H  -0.936104 -1.871915 -0.467746
H  2.628188 2.028757 1.522179
H  2.038643 2.12143 -0.155718
H  2.706654 0.18924 -1.845329
H  3.719803 -1.150383 -1.252657
H  4.29776 1.042509 -0.11306
H  3.720507 -0.17446 1.052791
H  -1.874074 0.633916 1.059988
H  -2.95878 -1.382561 2.053293
H  -3.379304 -1.998444 0.427344
H  -4.157559 -0.51136 1.055581
H  -2.557397 -0.415387 -1.628193
H  -4.443144 1.058527 -0.630463
H  -3.535655 1.750944 -2.014873
H  -3.115095 2.228061 -0.350239
