program: Orca
programVersion: 5.0.2
elementType: S F F F O O O N N N N N C C C C C C C C C C C C H H H H H H H H
charge: 0
multiplicity: 1
keywords: wb97x-d3
keywords: def2-TZVPP
keywords: def2/J RIJCOSX
keywords: DEFGRID2
keywords: scfconv7
keywords: smallprint printgap noloewdin
keywords: NOSOSCF
formula: C12H8F3N5O3S
InChI: InChI=1/C12H8F3N5O3S/c1-23-12-16-5-8(15)10-17-11(18-20(10)12)24(21,22)19-9-6(13)3-2-4-7(9)14/h2-5,19H,1H3
32 atoms
S  1.018428 1.249484 0.980128
F  -3.011606 -2.438771 2.563059
F  4.742985 -0.142166 1.183767
F  0.976987 -0.668611 -1.511657
O  1.042757 1.770073 2.323231
O  1.293589 2.040684 -0.188786
O  -3.808363 1.010995 -1.461749
N  -2.484274 0.139629 0.135657
N  2.01129 -0.084138 0.960067
N  -1.431498 0.925298 -0.115434
N  -0.982075 -0.480908 1.602781
N  -4.610012 -0.699396 -0.156286
C  -0.582308 0.502388 0.784623
C  -2.200552 -0.709843 1.177885
C  2.833238 -0.372895 -0.132852
C  -3.692454 0.128757 -0.505418
C  -3.225003 -1.605667 1.555576
C  4.217597 -0.395238 -0.016887
C  2.302568 -0.658684 -1.384062
C  -4.390323 -1.565503 0.866123
C  5.045733 -0.689675 -1.079325
C  3.097022 -0.927045 -2.478676
C  4.473536 -0.942473 -2.316344
C  -5.058432 1.063423 -2.143006
H  2.306344 -0.386532 1.877831
H  -5.203631 -2.235696 1.113534
H  6.117406 -0.701528 -0.939037
H  2.639972 -1.126381 -3.437567
H  5.108435 -1.157234 -3.164261
H  -5.87464 1.279705 -1.454211
H  -5.268419 0.124881 -2.655202
H  -4.960477 1.867034 -2.865987
totalener: -1659.32883436 hartree
nucrepener: 2322.28536104 hartree
electener: -3981.61419541 hartree
oneelecener: -6895.83539203 hartree
twoeener: 2914.22119663 hartree
kineticenergy: 1653.87899317 hartree
xcener: -131.103821219111 hartree
chargesum: -0.0000000
charge: 0.845783 -0.172503 -0.196580 -0.193899 -0.438967 -0.417147 -0.238052 0.144236 -0.225372 -0.254461 -0.306430 -0.366278 0.124175 0.143704 0.028900 0.397686 0.171965 0.220710 0.250837 -0.015648 -0.162566 -0.149200 -0.099829 -0.121026 0.164386 0.125470 0.126967 0.125740 0.132068 0.112053 0.112111 0.131166
qa: 0.8458 -0.1725 -0.1966 -0.1939 -0.4390 -0.4171 -0.2381 0.1442 -0.2254 -0.2545 -0.3064 -0.3663 0.1242 0.1437 0.0289 0.3977 0.1720 0.2207 0.2508 -0.0156 -0.1626 -0.1492 -0.0998 -0.1210 0.1644 0.1255 0.1270 0.1257 0.1321 0.1121 0.1121 0.1312
va: 5.8727 1.1302 1.0996 1.1087 2.0716 2.0810 2.1892 3.3833 3.0549 2.8401 3.1215 3.0510 4.0873 3.9640 3.6958 4.1580 3.9871 4.0783 4.0076 4.0140 3.9323 3.9868 3.8950 3.8565 1.0386 1.0031 1.0066 1.0071 0.9971 0.9993 0.9982 0.9921
dispcorr: -0.014864211 hartree
energy: -1659.343698571470
dipole: -7.21044 6.14418 -1.06626 1.16967 -2.47848 -1.30881 -13.40464 11.92170 -1.48294
magnitude: 2.24700 au
magnitude: 5.71143 debye
