program: Orca
programVersion: 5.0.2
elementType: Cl Cl S F O O O N N N N N C C C C C C C C C C C C C H H H H H H H H H H
charge: 0
multiplicity: 1
keywords: wb97x-d3
keywords: def2-TZVPP
keywords: def2/J RIJCOSX
keywords: DEFGRID2
keywords: scfconv7
keywords: smallprint printgap noloewdin
keywords: NOSOSCF
formula: C13H10Cl2FN5O3S
InChI: InChI=1/C13H10Cl2FN5O3S/c1-2-24-13-17-9(16)6-10-18-12(19-21(10)13)25(22,23)20-11-7(14)4-3-5-8(11)15/h3-6,20H,2H2,1H3
35 atoms
Cl -0.29922 -0.070668 2.134583
Cl -4.722268 -0.05754 -0.953278
S  -1.387311 -1.466463 -1.289845
F  5.542471 -1.147255 1.003487
O  2.774687 1.896966 -0.876224
O  -1.5153 -2.872266 -1.601673
O  -1.779805 -0.433175 -2.220812
N  2.051138 -0.195847 -0.541504
N  -2.211411 -1.220602 0.114328
N  0.830874 0.006705 -1.052193
N  1.058189 -2.132639 -0.323946
N  4.193631 0.361998 0.083138
C  0.31389 -1.17788 -0.879223
C  2.185623 -1.488508 -0.10178
C  3.060304 0.715076 -0.428972
C  -2.502097 0.077215 0.575686
C  3.410188 -1.878069 0.458505
C  -1.699772 0.726628 1.516056
C  -3.654764 0.733555 0.140207
C  4.344941 -0.893304 0.502387
C  3.751668 2.960484 -0.7380
C  -2.015855 1.98614 1.993832
C  -3.980084 1.998681 0.600441
C  -3.15422 2.618907 1.523203
C  3.726808 3.561847 0.644403
H  -2.094256 -1.95385 0.808552
H  3.577127 -2.881774 0.817971
H  4.738002 2.58382 -1.004686
H  3.448288 3.686951 -1.487338
H  -1.38135 2.467651 2.724545
H  -4.875479 2.492112 0.249672
H  -3.406727 3.604494 1.8891
H  4.037138 2.855665 1.413004
H  4.42249 4.400958 0.666022
H  2.737512 3.942921 0.895402
elementType: Cl S F O N C H
totalener: -2419.40497280 hartree
nucrepener: 2843.54216307 hartree
electener: -5262.94713587 hartree
oneelecener: -8982.75702278 hartree
twoeener: 3719.80988691 hartree
cpcmener: -0.04564844 hartree
kineticenergy: 2412.99782934 hartree
xcener: -162.346822580929 hartree
chargesum: -0.0000000
charge: -0.063647 -0.058044 0.873186 -0.178765 -0.272332 -0.505588 -0.495308 0.167300 -0.232050 -0.294826 -0.323821 -0.374496 0.061004 0.196388 0.464949 0.243634 -0.271208 -0.053704 -0.045399 0.367872 0.056362 -0.086999 -0.079543 -0.168425 -0.257399 0.201191 0.160170 0.101197 0.120051 0.150884 0.146158 0.166344 0.091649 0.100160 0.093053
qa: -0.0636 -0.0580 0.8732 -0.1788 -0.2723 -0.5056 -0.4953 0.1673 -0.2321 -0.2948 -0.3238 -0.3745 0.0610 0.1964 0.4649 0.2436 -0.2712 -0.0537 -0.0454 0.3679 0.0564 -0.0870 -0.0795 -0.1684 -0.2574 0.2012 0.1602 0.1012 0.1201 0.1509 0.1462 0.1663 0.0916 0.1002 0.0931
va: 1.2690 1.2621 5.8366 1.1189 2.2015 2.0031 1.9960 3.3971 3.0417 2.8685 3.1030 3.0033 4.2147 4.0371 4.1575 3.5572 3.9031 4.0165 4.0570 4.2163 3.8102 3.9188 3.9237 3.9532 3.9342 1.0119 1.0058 1.0095 0.9924 1.0002 1.0042 0.9856 1.0098 1.0060 1.0044
dispcorr: -0.020048322 hartree
energy: -2419.425021123586
dipole: 11.97667 -10.20957 1.76710 21.12280 -18.12344 2.99936 4.02581 -1.26187 2.76394
magnitude: 4.44502 au
magnitude: 11.29833 debye
