program: Orca
programVersion: 5.0.2
elementType: Cl Cl S F O O O N N N N N C C C C C C C C C C C C C H H H H H H H H H H
charge: 0
multiplicity: 1
keywords: wb97x-d3
keywords: def2-TZVPP
keywords: def2/J RIJCOSX
keywords: DEFGRID2
keywords: scfconv7
keywords: smallprint printgap noloewdin
keywords: NOSOSCF
formula: C13H10Cl2FN5O3S
InChI: InChI=1/C13H10Cl2FN5O3S/c1-2-24-13-17-9(16)6-10-18-12(19-21(10)13)25(22,23)20-11-7(14)4-3-5-8(11)15/h3-6,20H,2H2,1H3
35 atoms
Cl -4.4940 -1.411903 1.254838
Cl -0.805404 1.856841 -0.940416
S  -1.25229 -1.914359 -0.306947
F  4.832901 1.357944 -2.668532
O  3.138971 0.567849 1.45111
O  -1.311206 -2.151894 1.118302
O  -1.451924 -2.974635 -1.270519
N  2.054214 -0.180898 -0.353551
N  -2.342419 -0.727743 -0.659784
N  1.039486 -0.717591 0.333345
N  0.760978 -1.029256 -1.899487
N  4.017013 0.98203 -0.636493
C  0.325601 -1.186347 -0.65055
C  1.880388 -0.362379 -1.701186
C  3.126829 0.486254 0.158903
C  -2.629275 0.279591 0.281549
C  2.849682 0.158575 -2.570702
C  -3.614405 0.06752 1.247765
C  -1.985508 1.518435 0.272386
C  3.86623 0.812713 -1.949242
C  4.253467 1.220879 2.112847
C  -3.923531 1.035341 2.188146
C  -2.288061 2.500334 1.19934
C  -3.251783 2.246143 2.161017
C  5.45457 0.316508 2.210385
H  -2.435618 -0.503841 -1.647037
H  2.771424 0.049405 -3.641407
H  4.479722 2.15495 1.600108
H  3.859399 1.4573 3.097972
H  -4.686341 0.848551 2.930699
H  -1.775487 3.451514 1.173281
H  -3.490161 3.00544 2.892727
H  6.215849 0.822895 2.804023
H  5.208812 -0.61843 2.712694
H  5.889032 0.090584 1.23815
elementType: Cl S F O N C H
totalener: -2419.40471556 hartree
nucrepener: 2834.20882722 hartree
electener: -5253.61354278 hartree
oneelecener: -8964.19277501 hartree
twoeener: 3710.57923223 hartree
cpcmener: -0.04563634 hartree
kineticenergy: 2413.00428908 hartree
xcener: -162.347764004129 hartree
chargesum: -0.0000000
charge: -0.058639 -0.063252 0.872289 -0.178632 -0.270702 -0.496136 -0.506482 0.169245 -0.237622 -0.290055 -0.328201 -0.374469 0.063876 0.189647 0.465952 0.240031 -0.268915 -0.045785 -0.047044 0.367598 0.054274 -0.076508 -0.088316 -0.168481 -0.258430 0.204356 0.159952 0.101595 0.120981 0.145563 0.149907 0.166199 0.100516 0.092872 0.092819
qa: -0.0586 -0.0633 0.8723 -0.1786 -0.2707 -0.4961 -0.5065 0.1692 -0.2376 -0.2901 -0.3282 -0.3745 0.0639 0.1896 0.4660 0.2400 -0.2689 -0.0458 -0.0470 0.3676 0.0543 -0.0765 -0.0883 -0.1685 -0.2584 0.2044 0.1600 0.1016 0.1210 0.1456 0.1499 0.1662 0.1005 0.0929 0.0928
va: 1.2618 1.2700 5.8306 1.1188 2.2028 1.9931 1.9997 3.3927 3.0350 2.8677 3.0980 3.0039 4.2133 4.0420 4.1591 3.5593 3.9008 4.0533 4.0120 4.2156 3.8109 3.9211 3.9229 3.9533 3.9304 1.0096 1.0057 1.0088 0.9924 1.0043 1.0006 0.9856 1.0059 1.0044 1.0102
dispcorr: -0.019934637 hartree
energy: -2419.424650197558
dipole: 17.57748 -16.00552 1.57196 8.16096 -4.36226 3.79870 14.41993 -13.60380 0.81613
magnitude: 4.19133 au
magnitude: 10.65351 debye
