program: Orca
programVersion: 5.0.2
elementType: Cl Cl S F O O O N N N N N C C C C C C C C C C C C C H H H H H H H H H H
charge: 0
multiplicity: 1
keywords: wb97x-d3
keywords: def2-TZVPP
keywords: def2/J RIJCOSX
keywords: DEFGRID2
keywords: scfconv7
keywords: smallprint printgap noloewdin
keywords: NOSOSCF
formula: C13H10Cl2FN5O3S
InChI: InChI=1/C13H10Cl2FN5O3S/c1-2-24-13-17-9(16)6-10-18-12(19-21(10)13)25(22,23)20-11-7(14)4-3-5-8(11)15/h3-6,20H,2H2,1H3
35 atoms
Cl -0.428353 0.959534 1.91632
Cl -4.710896 -0.716699 -0.905542
S  -1.30064 -1.922943 -0.500175
F  5.269797 0.025779 1.991709
O  2.71507 1.484577 -1.451161
O  -1.378795 -3.326878 -0.164644
O  -1.669029 -1.423344 -1.805558
N  2.026672 -0.246968 -0.215413
N  -2.203499 -1.113654 0.619029
N  0.866254 -0.404987 -0.862616
N  1.060565 -1.909837 0.827914
N  4.034464 0.755777 0.290122
C  0.360252 -1.394558 -0.18116
C  2.137788 -1.151368 0.8102
C  2.981787 0.696133 -0.458794
C  -2.552802 0.234045 0.408455
C  3.284693 -1.105875 1.614562
C  -1.808441 1.291954 0.934249
C  -3.701099 0.548153 -0.320825
C  4.162068 -0.122569 1.284466
C  3.668495 2.510891 -1.826669
C  -2.165804 2.610689 0.716029
C  -4.06817 1.862423 -0.555819
C  -3.29121 2.887156 -0.041995
C  4.776785 1.955138 -2.684077
H  -2.072282 -1.428738 1.577242
H  3.433797 -1.791336 2.434445
H  3.066795 3.227206 -2.380357
H  4.04618 3.00017 -0.929777
H  -1.572039 3.412277 1.132247
H  -4.957374 2.084485 -1.128693
H  -3.57357 3.914915 -0.223151
H  5.406366 2.783672 -3.009333
H  5.408451 1.250523 -2.145532
H  4.38377 1.466339 -3.574913
elementType: Cl S F O N C H
totalener: -2419.40432936 hartree
nucrepener: 2845.83716961 hartree
electener: -5265.24149897 hartree
oneelecener: -8987.35289680 hartree
twoeener: 3722.11139783 hartree
cpcmener: -0.04527319 hartree
kineticenergy: 2413.00046754 hartree
xcener: -162.347024402588 hartree
chargesum: 0.0000000
charge: -0.064889 -0.058584 0.872752 -0.178323 -0.270401 -0.504534 -0.495432 0.165017 -0.228913 -0.293298 -0.326650 -0.373036 0.066787 0.181275 0.466772 0.245006 -0.261142 -0.053088 -0.052919 0.364439 0.055903 -0.083083 -0.073088 -0.172839 -0.258007 0.200186 0.160474 0.120200 0.100817 0.150495 0.146253 0.166045 0.100485 0.092304 0.093013
qa: -0.0649 -0.0586 0.8728 -0.1783 -0.2704 -0.5045 -0.4954 0.1650 -0.2289 -0.2933 -0.3267 -0.3730 0.0668 0.1813 0.4668 0.2450 -0.2611 -0.0531 -0.0529 0.3644 0.0559 -0.0831 -0.0731 -0.1728 -0.2580 0.2002 0.1605 0.1202 0.1008 0.1505 0.1463 0.1660 0.1005 0.0923 0.0930
va: 1.2687 1.2615 5.8327 1.1194 2.2027 2.0037 1.9951 3.3935 3.0389 2.8712 3.0970 3.0032 4.2112 4.0456 4.1555 3.5617 3.8981 4.0076 4.0587 4.2196 3.8107 3.9168 3.9183 3.9583 3.9323 1.0133 1.0055 0.9924 1.0092 1.0000 1.0039 0.9856 1.0058 1.0098 1.0044
dispcorr: -0.020165111 hartree
energy: -2419.424494469551
dipole: 14.65292 -12.97966 1.67326 16.41943 -12.54315 3.87629 -10.97528 11.94396 0.96868
magnitude: 4.33171 au
magnitude: 11.01033 debye
