program: Orca
programVersion: 5.0.2
elementType: Cl Cl S F O O O N N N N N C C C C C C C C C C C C C H H H H H H H H H H
charge: 0
multiplicity: 1
keywords: wb97x-d3
keywords: def2-TZVPP
keywords: def2/J RIJCOSX
keywords: DEFGRID2
keywords: scfconv7
keywords: smallprint printgap noloewdin
keywords: NOSOSCF
formula: C13H10Cl2FN5O3S
InChI: InChI=1/C13H10Cl2FN5O3S/c1-2-24-13-17-9(16)6-10-18-12(19-21(10)13)25(22,23)20-11-7(14)4-3-5-8(11)15/h3-6,20H,2H2,1H3
35 atoms
Cl -0.216704 -0.361147 2.111193
Cl -4.695745 0.111194 -0.859341
S  -1.424327 -1.401382 -1.401283
F  5.546606 -1.139165 0.777451
O  2.62724 2.000003 -0.668619
O  -1.567694 -2.780891 -1.807884
O  -1.83444 -0.299543 -2.241554
N  1.99838 -0.144112 -0.593675
N  -2.212404 -1.251066 0.041201
N  0.761001 0.076569 -1.048801
N  1.074402 -2.126758 -0.597792
N  4.126132 0.418572 0.071982
C  0.28548 -1.137214 -1.013169
C  2.186702 -1.47557 -0.322177
C  2.971817 0.785991 -0.378649
C  -2.431966 0.019475 0.609477
C  3.437885 -1.883163 0.162075
C  -1.578338 0.556376 1.575629
C  -3.558551 0.763782 0.254149
C  4.333098 -0.873334 0.322795
C  3.551009 3.085967 -0.407048
C  -1.813658 1.794501 2.146484
C  -3.805528 2.007583 0.81129
C  -2.925758 2.51875 1.75039
C  3.507624 3.513475 1.03791
H  -2.060871 -2.025304 0.681872
H  3.652025 -2.916211 0.388774
H  4.552697 2.795785 -0.720802
H  3.203637 3.881326 -1.061637
H  -1.138503 2.18909 2.892566
H  -4.682866 2.56889 0.521732
H  -3.116326 3.488334 2.189305
H  2.498442 3.791949 1.339726
H  3.876609 2.742527 1.712738
H  4.144445 4.390308 1.155933
elementType: Cl S F O N C H
totalener: -2419.40471837 hartree
nucrepener: 2857.00885239 hartree
electener: -5276.41357075 hartree
oneelecener: -9009.60925614 hartree
twoeener: 3733.19568538 hartree
cpcmener: -0.04537666 hartree
kineticenergy: 2413.00505849 hartree
xcener: -162.347683918300 hartree
chargesum: -0.0000000
charge: -0.065140 -0.057860 0.873191 -0.178531 -0.270832 -0.503821 -0.492890 0.164700 -0.223401 -0.298864 -0.321402 -0.373198 0.063013 0.195346 0.465521 0.246760 -0.270492 -0.059135 -0.053242 0.367796 0.054893 -0.080859 -0.077159 -0.172852 -0.258062 0.195750 0.159634 0.100939 0.120444 0.151029 0.146908 0.166245 0.092323 0.092052 0.101194
qa: -0.0651 -0.0579 0.8732 -0.1785 -0.2708 -0.5038 -0.4929 0.1647 -0.2234 -0.2989 -0.3214 -0.3732 0.0630 0.1953 0.4655 0.2468 -0.2705 -0.0591 -0.0532 0.3678 0.0549 -0.0809 -0.0772 -0.1729 -0.2581 0.1957 0.1596 0.1009 0.1204 0.1510 0.1469 0.1662 0.0923 0.0921 0.1012
va: 1.2672 1.2613 5.8324 1.1191 2.2016 2.0058 1.9978 3.3999 3.0452 2.8630 3.1057 3.0049 4.2093 4.0359 4.1573 3.5575 3.9045 4.0099 4.0578 4.2155 3.8120 3.9099 3.9192 3.9556 3.9342 1.0168 1.0060 1.0091 0.9922 0.9997 1.0037 0.9855 1.0044 1.0093 1.0061
dispcorr: -0.020336233 hartree
energy: -2419.425054598317
dipole: 11.55994 -9.68567 1.87427 20.98177 -18.12733 2.85444 6.14213 -3.15855 2.98358
magnitude: 4.53459 au
magnitude: 11.52600 debye
