program: Orca
programVersion: 5.0.2
elementType: Cl Cl S F O O O N N N N N C C C C C C C C C C C C C H H H H H H H H H H
charge: 0
multiplicity: 1
keywords: wb97x-d3
keywords: def2-TZVPP
keywords: def2/J RIJCOSX
keywords: DEFGRID2
keywords: scfconv7
keywords: smallprint printgap noloewdin
keywords: NOSOSCF
formula: C13H10Cl2FN5O3S
InChI: InChI=1/C13H10Cl2FN5O3S/c1-2-24-13-17-9(16)6-10-18-12(19-21(10)13)25(22,23)20-11-7(14)4-3-5-8(11)15/h3-6,20H,2H2,1H3
35 atoms
Cl -0.454772 0.543824 2.177088
Cl -4.635117 -0.399305 -1.104669
S  -1.339435 -1.898278 -0.684149
F  5.423813 -0.41168 1.642929
O  2.553013 1.732043 -1.123433
O  -1.425808 -3.324318 -0.462496
O  -1.694038 -1.298402 -1.950467
N  1.975853 -0.238396 -0.239871
N  -2.252153 -1.186489 0.493289
N  0.773803 -0.284978 -0.825253
N  1.095173 -2.095899 0.50833
N  4.026688 0.660312 0.284126
C  0.323768 -1.402646 -0.326311
C  2.168505 -1.331666 0.563873
C  2.907544 0.750857 -0.356739
C  -2.509661 0.197489 0.454797
C  3.384898 -1.444802 1.251666
C  -1.741212 1.114648 1.175618
C  -3.585201 0.691164 -0.2859
C  4.241871 -0.409608 1.048499
C  3.447635 2.86266 -1.296219
C  -2.00553 2.472263 1.137613
C  -3.854226 2.048364 -0.345808
C  -3.056172 2.931913 0.360948
C  4.499548 2.589404 -2.339094
H  -2.169212 -1.625981 1.406786
H  3.601448 -2.286583 1.891064
H  2.784381 3.665277 -1.60891
H  3.879999 3.129602 -0.332986
H  -1.397432 3.16359 1.703933
H  -4.68852 2.411552 -0.929202
H  -3.265606 3.991734 0.318537
H  5.071725 3.504265 -2.495191
H  5.196699 1.810166 -2.035658
H  4.051745 2.311534 -3.292754
elementType: Cl S F O N C H
totalener: -2419.40451586 hartree
nucrepener: 2850.33175597 hartree
electener: -5269.73627183 hartree
oneelecener: -8996.31649532 hartree
twoeener: 3726.58022348 hartree
cpcmener: -0.04546672 hartree
kineticenergy: 2412.99857225 hartree
xcener: -162.346210242166 hartree
chargesum: -0.0000000
charge: -0.065483 -0.058030 0.874123 -0.178578 -0.270738 -0.506360 -0.492952 0.167116 -0.223709 -0.300982 -0.321483 -0.373433 0.062119 0.197374 0.465397 0.249597 -0.270204 -0.063351 -0.057752 0.366485 0.053877 -0.076238 -0.072652 -0.174958 -0.257624 0.197996 0.160405 0.121374 0.101658 0.149914 0.145993 0.166219 0.100353 0.091693 0.092836
qa: -0.0655 -0.0580 0.8741 -0.1786 -0.2707 -0.5064 -0.4930 0.1671 -0.2237 -0.3010 -0.3215 -0.3734 0.0621 0.1974 0.4654 0.2496 -0.2702 -0.0634 -0.0578 0.3665 0.0539 -0.0762 -0.0727 -0.1750 -0.2576 0.1980 0.1604 0.1214 0.1017 0.1499 0.1460 0.1662 0.1004 0.0917 0.0928
va: 1.2665 1.2609 5.8299 1.1191 2.2018 2.0034 1.9979 3.4016 3.0443 2.8638 3.1049 3.0059 4.2091 4.0318 4.1550 3.5505 3.9040 4.0144 4.0571 4.2190 3.8101 3.9121 3.9168 3.9589 3.9325 1.0154 1.0056 0.9921 1.0093 1.0000 1.0041 0.9855 1.0057 1.0102 1.0044
dispcorr: -0.020200599 hartree
energy: -2419.424716460970
dipole: 13.93673 -12.24812 1.68861 19.02589 -15.12829 3.89760 -8.04820 9.52982 1.48162
magnitude: 4.49865 au
magnitude: 11.43467 debye
