program: Orca
programVersion: 5.0.2
elementType: Cl Cl S F O O O N N N N N C C C C C C C C C C C C C H H H H H H H H H H
charge: 0
multiplicity: 1
keywords: wb97x-d3
keywords: def2-TZVPP
keywords: def2/J RIJCOSX
keywords: DEFGRID2
keywords: scfconv7
keywords: smallprint printgap noloewdin
keywords: NOSOSCF
formula: C13H10Cl2FN5O3S
InChI: InChI=1/C13H10Cl2FN5O3S/c1-2-24-13-17-9(16)6-10-18-12(19-21(10)13)25(22,23)20-11-7(14)4-3-5-8(11)15/h3-6,20H,2H2,1H3
35 atoms
Cl -4.506918 -0.220261 1.815331
Cl -0.772771 -0.214585 -2.079906
S  -0.992564 -1.287506 1.595903
F  4.096914 3.231636 -1.087928
O  3.869503 -1.268077 -0.745122
O  -1.491445 -0.460327 2.666927
O  -0.616696 -2.668886 1.788961
N  2.174884 -0.018451 0.022801
N  -2.11111 -1.284484 0.376757
N  1.433619 -1.050304 0.446989
N  0.399861 0.920036 0.881597
N  3.992625 1.015532 -0.931956
C  0.40598 -0.414813 0.939296
C  1.546007 1.176104 0.283472
C  3.396195 -0.0749 -0.577675
C  -2.62503 -0.069236 -0.118395
C  2.18711 2.364216 -0.098937
C  -3.721699 0.542454 0.489996
C  -2.08657 0.542697 -1.252998
C  3.395988 2.182113 -0.692129
C  5.158946 -1.415283 -1.387868
C  -4.225875 1.74302 0.015749
C  -2.591692 1.728975 -1.750669
C  -3.653987 2.332394 -1.098221
C  5.520406 -2.874421 -1.338961
H  -1.963337 -2.026563 -0.301581
H  1.7421 3.332013 0.075367
H  5.079645 -1.053506 -2.414101
H  5.892404 -0.804098 -0.861011
H  -5.070154 2.20696 0.506368
H  -2.158733 2.178692 -2.633261
H  -4.050982 3.265735 -1.473307
H  6.482751 -3.010202 -1.832259
H  5.617776 -3.231181 -0.313722
H  4.788645 -3.491842 -1.859695
elementType: Cl S F O N C H
totalener: -2419.40601596 hartree
nucrepener: 2833.67935687 hartree
electener: -5253.08537283 hartree
oneelecener: -8963.03133004 hartree
twoeener: 3709.94595721 hartree
cpcmener: -0.03813243 hartree
kineticenergy: 2412.98878184 hartree
xcener: -162.342520968498 hartree
chargesum: 0.0000000
charge: -0.052392 -0.066824 0.868130 -0.176523 -0.259300 -0.473070 -0.493150 0.172359 -0.220313 -0.281249 -0.327843 -0.368829 0.043884 0.199836 0.455930 0.258363 -0.279188 -0.066011 -0.074019 0.368882 0.038255 -0.073360 -0.064549 -0.175163 -0.244056 0.189767 0.158021 0.112232 0.107105 0.141074 0.144238 0.161880 0.092074 0.091789 0.092019
qa: -0.0524 -0.0668 0.8681 -0.1765 -0.2593 -0.4731 -0.4931 0.1724 -0.2203 -0.2812 -0.3278 -0.3688 0.0439 0.1998 0.4559 0.2584 -0.2792 -0.0660 -0.0740 0.3689 0.0383 -0.0734 -0.0645 -0.1752 -0.2441 0.1898 0.1580 0.1122 0.1071 0.1411 0.1442 0.1619 0.0921 0.0918 0.0920
va: 1.2660 1.2653 5.8518 1.1209 2.2083 2.0248 2.0147 3.3940 3.0531 2.8901 3.0488 3.0184 4.2031 4.0258 4.1706 3.5128 3.9042 4.0719 4.0301 4.2186 3.8084 3.9183 3.9058 3.9634 3.9657 1.0226 1.0064 0.9969 0.9980 1.0063 1.0020 0.9871 1.0055 1.0038 1.0033
dispcorr: -0.019866220 hartree
energy: -2419.425882184581
dipole: 18.46162 -17.03604 1.42558 -5.18496 6.55151 1.36655 -9.06323 5.83890 -3.22433
magnitude: 3.78101 au
magnitude: 9.61056 debye
