program: Orca
programVersion: 5.0.2
elementType: Cl Cl S F O O O N N N N N C C C C C C C C C C C C C H H H H H H H H H H
charge: 0
multiplicity: 1
keywords: wb97x-d3
keywords: def2-TZVPP
keywords: def2/J RIJCOSX
keywords: DEFGRID2
keywords: scfconv7
keywords: smallprint printgap noloewdin
keywords: NOSOSCF
formula: C13H10Cl2FN5O3S
InChI: InChI=1/C13H10Cl2FN5O3S/c1-2-24-13-17-9(16)6-10-18-12(19-21(10)13)25(22,23)20-11-7(14)4-3-5-8(11)15/h3-6,20H,2H2,1H3
35 atoms
Cl -4.128592 -1.29899 1.848893
Cl -0.855655 1.732956 -1.185897
S  -1.36188 -2.01886 -0.439606
F  4.945591 0.901633 -2.756595
O  2.788798 0.902341 1.218227
O  -1.304886 -2.456078 0.934581
O  -1.697246 -2.906443 -1.52705
N  1.917588 -0.219219 -0.510699
N  -2.419877 -0.753132 -0.525575
N  0.856387 -0.676424 0.161843
N  0.768606 -1.316971 -2.010712
N  3.898106 0.911953 -0.793464
C  0.226539 -1.309542 -0.791615
C  1.871525 -0.61633 -1.825432
C  2.920896 0.56139 -0.023724
C  -2.401587 0.248364 0.463366
C  2.928923 -0.240024 -2.667779
C  -3.123667 0.081571 1.646651
C  -1.685588 1.436872 0.300126
C  3.890973 0.5056 -2.062336
C  3.780355 1.773554 1.811913
C  -3.082344 1.032915 2.652696
C  -1.645411 2.402359 1.290001
C  -2.333597 2.183109 2.471658
C  3.293011 2.128808 3.190019
H  -2.688027 -0.4908 -1.470409
H  2.960323 -0.530165 -3.706859
H  4.735791 1.247877 1.844365
H  3.894198 2.66105 1.188101
H  -3.63893 0.88021 3.566907
H  -1.080909 3.3125 1.142519
H  -2.298318 2.926684 3.256377
H  3.180746 1.247181 3.821042
H  4.025583 2.784498 3.660687
H  2.342177 2.660728 3.154898
elementType: Cl S F O N C H
totalener: -2419.40604702 hartree
nucrepener: 2866.38027663 hartree
electener: -5285.78632364 hartree
oneelecener: -9028.24214389 hartree
twoeener: 3742.45582025 hartree
cpcmener: -0.03914968 hartree
kineticenergy: 2412.98017707 hartree
xcener: -162.341759649663 hartree
chargesum: -0.0000000
charge: -0.053788 -0.067068 0.865528 -0.176933 -0.258887 -0.476597 -0.491076 0.164302 -0.227387 -0.309369 -0.313197 -0.368004 0.065251 0.202160 0.455008 0.249594 -0.276137 -0.057666 -0.064833 0.367418 0.036189 -0.071236 -0.074482 -0.175666 -0.242770 0.195630 0.157645 0.112908 0.106668 0.144148 0.146012 0.162261 0.092936 0.092387 0.089051
qa: -0.0538 -0.0671 0.8655 -0.1769 -0.2589 -0.4766 -0.4911 0.1643 -0.2274 -0.3094 -0.3132 -0.3680 0.0653 0.2022 0.4550 0.2496 -0.2761 -0.0577 -0.0648 0.3674 0.0362 -0.0712 -0.0745 -0.1757 -0.2428 0.1956 0.1576 0.1129 0.1067 0.1441 0.1460 0.1623 0.0929 0.0924 0.0891
va: 1.2650 1.2641 5.8522 1.1201 2.2015 2.0161 2.0239 3.3993 3.0468 2.8399 3.1155 3.0202 4.1942 4.0249 4.1681 3.5464 3.9094 4.0610 4.0231 4.2186 3.8104 3.9187 3.9112 3.9635 3.9670 1.0163 1.0066 0.9965 0.9979 1.0051 1.0021 0.9868 1.0030 1.0061 1.0037
dispcorr: -0.020373289 hartree
energy: -2419.426420304634
dipole: 12.78637 -11.22941 1.55696 14.13226 -10.21703 3.91523 16.96792 -15.85698 1.11094
magnitude: 4.35745 au
magnitude: 11.07575 debye
