program: Orca
programVersion: 5.0.2
elementType: Cl Cl S F O O O N N N N N C C C C C C C C C C C C C H H H H H H H H H H
charge: 0
multiplicity: 1
keywords: wb97x-d3
keywords: def2-TZVPP
keywords: def2/J RIJCOSX
keywords: DEFGRID2
keywords: scfconv7
keywords: smallprint printgap noloewdin
keywords: NOSOSCF
formula: C13H10Cl2FN5O3S
InChI: InChI=1/C13H10Cl2FN5O3S/c1-2-24-13-17-9(16)6-10-18-12(19-21(10)13)25(22,23)20-11-7(14)4-3-5-8(11)15/h3-6,20H,2H2,1H3
35 atoms
Cl -0.52524 1.611834 1.330569
Cl -4.803743 -1.392002 0.008138
S  -1.219758 -1.801285 -0.327673
F  4.560443 2.434531 -1.864579
O  3.72106 -0.588192 1.390187
O  -0.892792 -3.098175 0.217735
O  -1.978687 -1.633016 -1.543026
N  2.184216 -0.226735 -0.200213
N  -1.991976 -0.965726 0.859047
N  1.291563 -1.098793 0.28278
N  0.482215 -0.058907 -1.560686
N  4.160277 0.944007 -0.26382
C  0.316422 -0.939004 -0.570902
C  1.695442 0.401472 -1.321847
C  3.41179 0.063123 0.313794
C  -2.709503 0.211073 0.580626
C  2.507868 1.352994 -1.958425
C  -2.146327 1.476802 0.75215
C  -4.03763 0.140517 0.155498
C  3.710775 1.554847 -1.358084
C  4.984987 -0.310363 2.040357
C  -2.8648 2.63137 0.496038
C  -4.765902 1.286247 -0.118408
C  -4.171343 2.525557 0.048949
C  6.128583 -1.048003 1.392159
H  -1.632589 -1.108536 1.798848
H  2.183823 1.874453 -2.846221
H  5.153332 0.766603 2.058532
H  4.828223 -0.649619 3.061878
H  -2.409233 3.601406 0.638898
H  -5.79199 1.211952 -0.450685
H  -4.738136 3.422599 -0.160611
H  5.95662 -2.124269 1.38445
H  6.315713 -0.712711 0.372798
H  7.031917 -0.859789 1.973656
elementType: Cl S F O N C H
totalener: -2419.40513216 hartree
nucrepener: 2815.74871783 hartree
electener: -5235.15385000 hartree
oneelecener: -8927.26268049 hartree
twoeener: 3692.10883050 hartree
cpcmener: -0.03873631 hartree
kineticenergy: 2412.96935443 hartree
xcener: -162.341829466781 hartree
chargesum: 0.0000000
charge: -0.066366 -0.054320 0.862084 -0.178099 -0.266509 -0.491335 -0.479495 0.160435 -0.242032 -0.298411 -0.315447 -0.373269 0.063122 0.197349 0.461209 0.246479 -0.274650 -0.050669 -0.042210 0.364387 0.054522 -0.092143 -0.079120 -0.165823 -0.259594 0.202920 0.158409 0.099683 0.119943 0.147506 0.143972 0.162610 0.093372 0.093235 0.098256
qa: -0.0664 -0.0543 0.8621 -0.1781 -0.2665 -0.4913 -0.4795 0.1604 -0.2420 -0.2984 -0.3154 -0.3733 0.0631 0.1973 0.4612 0.2465 -0.2746 -0.0507 -0.0422 0.3644 0.0545 -0.0921 -0.0791 -0.1658 -0.2596 0.2029 0.1584 0.0997 0.1199 0.1475 0.1440 0.1626 0.0934 0.0932 0.0983
va: 1.2632 1.2660 5.8634 1.1195 2.2062 2.0150 2.0198 3.4050 3.0419 2.8899 3.0731 3.0029 4.2011 4.0328 4.1596 3.5490 3.9050 4.0182 4.0574 4.2157 3.8109 3.9277 3.9270 3.9556 3.9307 1.0093 1.0063 1.0101 0.9923 1.0015 1.0050 0.9869 1.0041 1.0105 1.0062
dispcorr: -0.019735086 hartree
energy: -2419.424867248003
dipole: 18.86483 -17.23216 1.63268 2.36988 0.50545 2.87533 7.23326 -5.45670 1.77656
magnitude: 3.75357 au
magnitude: 9.54083 debye
