program: Orca
programVersion: 5.0.2
elementType: Cl Cl S F O O O N N N N N C C C C C C C C C C C C C H H H H H H H H H H
charge: 0
multiplicity: 1
keywords: wb97x-d3
keywords: def2-TZVPP
keywords: def2/J RIJCOSX
keywords: DEFGRID2
keywords: scfconv7
keywords: smallprint printgap noloewdin
keywords: NOSOSCF
formula: C13H10Cl2FN5O3S
InChI: InChI=1/C13H10Cl2FN5O3S/c1-2-24-13-17-9(16)6-10-18-12(19-21(10)13)25(22,23)20-11-7(14)4-3-5-8(11)15/h3-6,20H,2H2,1H3
35 atoms
Cl -0.840053 1.863506 0.9253
Cl -4.886348 -1.195966 -0.863172
S  -1.061574 -1.396158 -0.41061
F  5.200438 1.773281 -2.479751
O  4.001041 -0.548809 1.207922
O  -1.217409 -1.645522 1.004049
O  -1.165115 -2.452025 -1.394844
N  2.488774 -0.182099 -0.404227
N  -2.095138 -0.188169 -0.83266
N  1.481703 -0.815078 0.215528
N  0.81259 -0.008346 -1.793783
N  4.623487 0.630683 -0.659918
C  0.534008 -0.666788 -0.666779
C  2.079589 0.309547 -1.620834
C  3.760569 -0.017197 0.052171
C  -2.954298 0.411485 0.101596
C  3.010429 1.013844 -2.39956
C  -2.499349 1.403297 0.969181
C  -4.302329 0.057869 0.165962
C  4.24375 1.121351 -1.838567
C  5.335395 -0.428815 1.758567
C  -3.352407 2.027685 1.862662
C  -5.17574 0.689552 1.033945
C  -4.690517 1.670236 1.883273
C  5.360159 -1.197588 3.051321
H  -2.378585 -0.192003 -1.807758
H  2.749447 1.429129 -3.360951
H  6.052399 -0.830543 1.041639
H  5.556532 0.627874 1.915074
H  -2.978662 2.791702 2.530071
H  -6.219535 0.409118 1.057912
H  -5.364356 2.162784 2.571015
H  4.650956 -0.797087 3.775653
H  5.147561 -2.255364 2.89693
H  6.357917 -1.117997 3.482628
elementType: Cl S F O N C H
totalener: -2419.40689724 hartree
nucrepener: 2762.29897865 hartree
electener: -5181.70587589 hartree
oneelecener: -8820.69120556 hartree
twoeener: 3638.98532968 hartree
cpcmener: -0.03678830 hartree
kineticenergy: 2412.98109474 hartree
xcener: -162.341875526259 hartree
chargesum: -0.0000000
charge: -0.058252 -0.059367 0.862065 -0.177070 -0.259102 -0.479063 -0.490254 0.159921 -0.246349 -0.288563 -0.347314 -0.370805 0.094809 0.204766 0.455255 0.211598 -0.276369 -0.000084 -0.056146 0.367753 0.039816 -0.091578 -0.091975 -0.164459 -0.243947 0.198253 0.157896 0.107514 0.110304 0.146163 0.146222 0.162974 0.091940 0.091815 0.091633
qa: -0.0583 -0.0594 0.8621 -0.1771 -0.2591 -0.4791 -0.4903 0.1599 -0.2463 -0.2886 -0.3473 -0.3708 0.0948 0.2048 0.4553 0.2116 -0.2764 -0.0001 -0.0561 0.3678 0.0398 -0.0916 -0.0920 -0.1645 -0.2439 0.1983 0.1579 0.1075 0.1103 0.1462 0.1462 0.1630 0.0919 0.0918 0.0916
va: 1.2693 1.2686 5.8432 1.1197 2.2074 2.0059 2.0046 3.4018 3.0409 2.8761 3.1030 3.0176 4.1646 4.0525 4.1723 3.5534 3.9001 3.9985 4.0573 4.2183 3.8088 3.9428 3.9289 3.9469 3.9661 1.0154 1.0066 0.9977 0.9970 1.0026 1.0035 0.9867 1.0033 1.0036 1.0055
dispcorr: -0.018301267 hartree
energy: -2419.425198503226
dipole: 15.41169 -14.55491 0.85678 -0.61532 2.91664 2.30132 15.83832 -15.11474 0.72358
magnitude: 2.56002 au
magnitude: 6.50706 debye
