program: Orca
programVersion: 5.0.2
elementType: Cl Cl S F O O O N N N N N C C C C C C C C C C C C C H H H H H H H H H H
charge: 0
multiplicity: 1
keywords: wb97x-d3
keywords: def2-TZVPP
keywords: def2/J RIJCOSX
keywords: DEFGRID2
keywords: scfconv7
keywords: smallprint printgap noloewdin
keywords: NOSOSCF
formula: C13H10Cl2FN5O3S
InChI: InChI=1/C13H10Cl2FN5O3S/c1-2-24-13-17-9(16)6-10-18-12(19-21(10)13)25(22,23)20-11-7(14)4-3-5-8(11)15/h3-6,20H,2H2,1H3
35 atoms
Cl -0.441505 1.285469 1.626338
Cl -4.759417 -0.922489 -0.725508
S  -1.290239 -1.859855 -0.418605
F  5.376341 -0.04989 1.973643
O  3.088921 0.95127 -1.797334
O  -1.388777 -3.249947 -0.03973
O  -1.653146 -1.380045 -1.731329
N  2.161986 -0.396604 -0.268203
N  -2.160927 -0.995641 0.679622
N  1.009987 -0.567017 -0.931402
N  1.010046 -1.747903 1.004199
N  4.263645 0.451349 0.11342
C  0.387767 -1.373289 -0.116683
C  2.159314 -1.11043 0.907309
C  3.224547 0.36549 -0.650858
C  -2.628683 0.297472 0.388981
C  3.286923 -1.026273 1.738036
C  -1.937252 1.444715 0.780131
C  -3.846563 0.463961 -0.272388
C  4.273817 -0.221595 1.262632
C  4.172881 1.765224 -2.310642
C  -2.433648 2.711554 0.527546
C  -4.351951 1.723995 -0.543756
C  -3.639113 2.841274 -0.141644
C  4.162909 3.15308 -1.722648
H  -2.006648 -1.246122 1.652463
H  3.342049 -1.553155 2.678294
H  5.12065 1.255058 -2.139131
H  3.986353 1.791726 -3.381766
H  -1.884294 3.5870 0.844715
H  -5.297502 1.833318 -1.056383
H  -4.033031 3.827612 -0.34558
H  4.38495 3.15531 -0.656241
H  4.931642 3.743774 -2.222262
H  3.205766 3.648468 -1.885912
elementType: Cl S F O N C H
totalener: -2419.40556888 hartree
nucrepener: 2825.51414309 hartree
electener: -5244.91971197 hartree
oneelecener: -8946.74655831 hartree
twoeener: 3701.82684634 hartree
cpcmener: -0.03844503 hartree
kineticenergy: 2412.97868263 hartree
xcener: -162.342968130876 hartree
chargesum: -0.0000000
charge: -0.063740 -0.055202 0.862728 -0.177604 -0.263987 -0.490244 -0.483472 0.168170 -0.243437 -0.281466 -0.332247 -0.374482 0.068427 0.184844 0.459079 0.226090 -0.269851 -0.033571 -0.032920 0.364108 0.053322 -0.100313 -0.082109 -0.162829 -0.259159 0.201325 0.158076 0.100016 0.120524 0.147812 0.144007 0.163184 0.093116 0.099296 0.092507
qa: -0.0637 -0.0552 0.8627 -0.1776 -0.2640 -0.4902 -0.4835 0.1682 -0.2434 -0.2815 -0.3322 -0.3745 0.0684 0.1848 0.4591 0.2261 -0.2699 -0.0336 -0.0329 0.3641 0.0533 -0.1003 -0.0821 -0.1628 -0.2592 0.2013 0.1581 0.1000 0.1205 0.1478 0.1440 0.1632 0.0931 0.0993 0.0925
va: 1.2696 1.2661 5.8547 1.1201 2.2088 2.0182 2.0093 3.3859 3.0338 2.8701 3.0896 3.0035 4.2049 4.0463 4.1645 3.5657 3.9007 4.0091 4.0567 4.2179 3.8122 3.9368 3.9324 3.9506 3.9306 1.0115 1.0067 1.0099 0.9920 1.0018 1.0051 0.9866 1.0101 1.0061 1.0044
dispcorr: -0.019756450 hartree
energy: -2419.425325333875
dipole: 12.93788 -11.40878 1.52909 18.33609 -14.79740 3.53869 -9.16829 9.88536 0.71707
magnitude: 3.92105 au
magnitude: 9.96652 debye
