program: Orca
programVersion: 5.0.2
elementType: Cl Cl S F O O O N N N N N C C C C C C C C C C C C C H H H H H H H H H H
charge: 0
multiplicity: 1
keywords: wb97x-d3
keywords: def2-TZVPP
keywords: def2/J RIJCOSX
keywords: DEFGRID2
keywords: scfconv7
keywords: smallprint printgap noloewdin
keywords: NOSOSCF
formula: C13H10Cl2FN5O3S
InChI: InChI=1/C13H10Cl2FN5O3S/c1-2-24-13-17-9(16)6-10-18-12(19-21(10)13)25(22,23)20-11-7(14)4-3-5-8(11)15/h3-6,20H,2H2,1H3
35 atoms
Cl -0.444055 0.567774 2.160963
Cl -4.641639 -0.40972 -1.0880
S  -1.348062 -1.901223 -0.681702
F  5.441442 -0.405178 1.613743
O  2.546075 1.733139 -1.124756
O  -1.436466 -3.323296 -0.447321
O  -1.70175 -1.291542 -1.941887
N  1.976343 -0.239648 -0.239118
N  -2.244661 -1.176558 0.499215
N  0.771116 -0.286565 -0.818915
N  1.104617 -2.103206 0.496282
N  4.027753 0.66033 0.268241
C  0.320844 -1.412478 -0.334387
C  2.181597 -1.342506 0.554133
C  2.903039 0.750322 -0.36196
C  -2.510947 0.204367 0.456719
C  3.405444 -1.451918 1.232611
C  -1.740815 1.128444 1.166886
C  -3.594382 0.689634 -0.278785
C  4.255239 -0.410164 1.027196
C  3.441468 2.860895 -1.293013
C  -2.01345 2.484452 1.127106
C  -3.871301 2.045432 -0.340294
C  -3.073168 2.935493 0.357907
C  4.516663 2.582323 -2.310967
H  -2.191353 -1.626451 1.408723
H  3.632202 -2.296215 1.865522
H  2.782853 3.659445 -1.627074
H  3.85607 3.139718 -0.324249
H  -1.404267 3.181283 1.685806
H  -4.712346 2.402672 -0.918122
H  -3.289849 3.99423 0.314816
H  5.080125 3.501715 -2.475044
H  5.21861 1.818836 -1.978497
H  4.091025 2.27978 -3.267746
elementType: Cl S F O N C H
totalener: -2419.40538100 hartree
nucrepener: 2849.56183146 hartree
electener: -5268.96721246 hartree
oneelecener: -8994.74876960 hartree
twoeener: 3725.78155714 hartree
cpcmener: -0.03846172 hartree
kineticenergy: 2412.97156581 hartree
xcener: -162.341349424722 hartree
chargesum: 0.0000000
charge: -0.066741 -0.054156 0.864755 -0.177532 -0.264353 -0.490862 -0.478422 0.164140 -0.228214 -0.300312 -0.318259 -0.372864 0.066160 0.192862 0.457792 0.244501 -0.270727 -0.060597 -0.051373 0.363395 0.052285 -0.080068 -0.073636 -0.172290 -0.258855 0.196218 0.158430 0.120085 0.100412 0.146887 0.143634 0.162519 0.098898 0.093213 0.093075
qa: -0.0667 -0.0542 0.8648 -0.1775 -0.2644 -0.4909 -0.4784 0.1641 -0.2282 -0.3003 -0.3183 -0.3729 0.0662 0.1929 0.4578 0.2445 -0.2707 -0.0606 -0.0514 0.3634 0.0523 -0.0801 -0.0736 -0.1723 -0.2589 0.1962 0.1584 0.1201 0.1004 0.1469 0.1436 0.1625 0.0989 0.0932 0.0931
va: 1.2645 1.2649 5.8538 1.1203 2.2062 2.0232 2.0151 3.3968 3.0441 2.8533 3.1091 3.0053 4.1988 4.0343 4.1628 3.5601 3.9040 4.0164 4.0610 4.2191 3.8125 3.9189 3.9226 3.9611 3.9294 1.0157 1.0064 0.9920 1.0094 1.0014 1.0053 0.9869 1.0061 1.0104 1.0043
dispcorr: -0.020216882 hartree
energy: -2419.425597877422
dipole: 13.91266 -12.36105 1.55161 18.97500 -15.27572 3.69928 -7.95643 9.30314 1.34672
magnitude: 4.23152 au
magnitude: 10.75568 debye
