program: Orca
programVersion: 5.0.2
elementType: Cl Cl S F O O O N N N N N C C C C C C C C C C C C C H H H H H H H H H H
charge: 0
multiplicity: 1
keywords: wb97x-d3
keywords: def2-TZVPP
keywords: def2/J RIJCOSX
keywords: DEFGRID2
keywords: scfconv7
keywords: smallprint printgap noloewdin
keywords: NOSOSCF
formula: C13H10Cl2FN5O3S
InChI: InChI=1/C13H10Cl2FN5O3S/c1-2-24-13-17-9(16)6-10-18-12(19-21(10)13)25(22,23)20-11-7(14)4-3-5-8(11)15/h3-6,20H,2H2,1H3
35 atoms
Cl -4.37044 1.635065 0.7926
Cl -0.634206 -2.211021 0.193447
S  -1.58492 1.128911 -1.510453
F  5.059273 -1.949124 -1.586857
O  2.754347 0.429261 1.498535
O  -1.948908 1.109607 -2.906783
O  -1.667451 2.3166 -0.695064
N  1.863603 0.077634 -0.519658
N  -2.481977 -0.051037 -0.778999
N  0.732558 0.742147 -0.263147
N  0.685196 -0.153094 -2.345188
N  3.94772 -0.772688 -0.059821
C  0.08931 0.556262 -1.38428
C  1.840125 -0.459206 -1.78482
C  2.913502 -0.101605 0.328241
C  -2.420079 -0.227136 0.615747
C  2.961953 -1.184872 -2.214539
C  -3.226795 0.538146 1.460164
C  -1.582045 -1.178104 1.202803
C  3.95426 -1.283843 -1.290066
C  3.803279 0.307414 2.488313
C  -3.157024 0.400354 2.836879
C  -1.513118 -1.33922 2.574565
C  -2.292576 -0.531392 3.385658
C  4.858157 1.368645 2.308226
H  -2.638073 -0.873672 -1.354973
H  3.012732 -1.626116 -3.198218
H  3.280166 0.429861 3.434122
H  4.222436 -0.698124 2.454917
H  -3.781635 1.009455 3.475276
H  -0.856025 -2.08189 3.005107
H  -2.236725 -0.640625 4.460162
H  5.412924 1.247672 1.378384
H  4.424844 2.368492 2.333736
H  5.569564 1.293157 3.131357
elementType: Cl S F O N C H
totalener: -2419.40507810 hartree
nucrepener: 2864.14754312 hartree
electener: -5283.55262123 hartree
oneelecener: -9023.84217207 hartree
twoeener: 3740.28955084 hartree
cpcmener: -0.03839010 hartree
kineticenergy: 2412.98645163 hartree
xcener: -162.344023961706 hartree
chargesum: -0.0000000
charge: -0.053448 -0.067285 0.866309 -0.177587 -0.264957 -0.490118 -0.476667 0.161639 -0.224096 -0.305520 -0.314227 -0.370730 0.066354 0.194839 0.460636 0.247554 -0.271509 -0.057087 -0.065569 0.362262 0.051684 -0.071228 -0.073159 -0.174717 -0.257276 0.192132 0.158229 0.118731 0.100129 0.141817 0.146339 0.162036 0.091811 0.093590 0.099088
qa: -0.0534 -0.0673 0.8663 -0.1776 -0.2650 -0.4901 -0.4767 0.1616 -0.2241 -0.3055 -0.3142 -0.3707 0.0664 0.1948 0.4606 0.2476 -0.2715 -0.0571 -0.0656 0.3623 0.0517 -0.0712 -0.0732 -0.1747 -0.2573 0.1921 0.1582 0.1187 0.1001 0.1418 0.1463 0.1620 0.0918 0.0936 0.0991
va: 1.2651 1.2648 5.8498 1.1199 2.2035 2.0246 2.0163 3.4008 3.0497 2.8466 3.1113 3.0053 4.1932 4.0339 4.1574 3.5473 3.9052 4.0628 4.0234 4.2198 3.8154 3.9205 3.9132 3.9626 3.9347 1.0194 1.0063 0.9920 1.0092 1.0058 1.0016 0.9870 1.0098 1.0040 1.0064
dispcorr: -0.020516726 hartree
energy: -2419.425594830399
dipole: 17.31385 -15.27667 2.03718 2.98973 -5.07913 -2.08940 17.89100 -14.70320 3.18780
magnitude: 4.32178 au
magnitude: 10.98509 debye
