program: Orca
programVersion: 5.0.2
elementType: Cl Cl S F O O O N N N N N C C C C C C C C C C C C C H H H H H H H H H H
charge: 0
multiplicity: 1
keywords: wb97x-d3
keywords: def2-TZVPP
keywords: def2/J RIJCOSX
keywords: DEFGRID2
keywords: scfconv7
keywords: smallprint printgap noloewdin
keywords: NOSOSCF
formula: C13H10Cl2FN5O3S
InChI: InChI=1/C13H10Cl2FN5O3S/c1-2-24-13-17-9(16)6-10-18-12(19-21(10)13)25(22,23)20-11-7(14)4-3-5-8(11)15/h3-6,20H,2H2,1H3
35 atoms
Cl -0.460294 0.832425 -1.994079
Cl -4.760997 -0.956136 0.729774
S  -1.184179 -1.752006 0.779959
F  4.152489 3.245658 0.65378
O  3.924144 -1.044191 -0.753165
O  -1.886521 -1.375483 1.98265
O  -0.808358 -3.115585 0.488838
N  2.155112 -0.122016 0.2657
N  -2.06761 -1.231539 -0.517096
N  1.37025 -1.201712 0.158397
N  0.286783 0.481489 1.223365
N  4.056471 1.13248 -0.030838
C  0.288605 -0.764763 0.743286
C  1.496163 0.900639 0.90663
C  3.434593 0.009845 -0.182359
C  -2.606409 0.069333 -0.538609
C  2.169274 2.119034 1.081687
C  -1.949104 1.128537 -1.169873
C  -3.844038 0.331454 0.05154
C  3.429491 2.140571 0.572049
C  5.292982 -1.016441 -1.226915
C  -2.474132 2.407869 -1.179114
C  -4.373908 1.61146 0.066755
C  -3.680126 2.644236 -0.540187
C  6.277657 -1.236927 -0.106739
H  -1.770359 -1.630772 -1.403797
H  1.703213 2.961708 1.569046
H  5.330754 -1.828977 -1.948857
H  5.475333 -0.079863 -1.753871
H  -1.946177 3.211467 -1.673329
H  -5.328186 1.798182 0.539441
H  -4.092609 3.643886 -0.529966
H  6.270994 -0.425514 0.619998
H  6.087858 -2.176671 0.411828
H  7.279665 -1.289522 -0.534174
elementType: Cl S F O N C H
totalener: -2419.40463539 hartree
nucrepener: 2837.56347819 hartree
electener: -5256.96811358 hartree
oneelecener: -8970.84939656 hartree
twoeener: 3713.88128299 hartree
cpcmener: -0.03789078 hartree
kineticenergy: 2412.98037728 hartree
xcener: -162.342957372850 hartree
chargesum: -0.0000000
charge: -0.067507 -0.053431 0.867280 -0.177204 -0.264364 -0.475149 -0.492821 0.168968 -0.224658 -0.286230 -0.327737 -0.372768 0.055590 0.186971 0.460817 0.263847 -0.270796 -0.075517 -0.066682 0.364238 0.054230 -0.067474 -0.070551 -0.177571 -0.259675 0.193712 0.157129 0.119789 0.100272 0.146397 0.143092 0.161957 0.093813 0.093249 0.098782
qa: -0.0675 -0.0534 0.8673 -0.1772 -0.2644 -0.4751 -0.4928 0.1690 -0.2247 -0.2862 -0.3277 -0.3728 0.0556 0.1870 0.4608 0.2638 -0.2708 -0.0755 -0.0667 0.3642 0.0542 -0.0675 -0.0706 -0.1776 -0.2597 0.1937 0.1571 0.1198 0.1003 0.1464 0.1431 0.1620 0.0938 0.0932 0.0988
va: 1.2630 1.2649 5.8532 1.1209 2.2098 2.0233 2.0158 3.3927 3.0510 2.8917 3.0523 3.0015 4.2026 4.0382 4.1613 3.5229 3.9018 4.0298 4.0719 4.2153 3.8115 3.9057 3.9148 3.9656 3.9316 1.0189 1.0069 0.9923 1.0095 1.0010 1.0053 0.9871 1.0098 1.0044 1.0061
dispcorr: -0.020254647 hartree
energy: -2419.424890036135
dipole: 20.83022 -18.96225 1.86797 0.64944 1.81031 2.45975 -3.49132 1.39899 -2.09233
magnitude: 3.73062 au
magnitude: 9.48248 debye
