program: Orca
programVersion: 5.0.2
elementType: Cl Cl S F O O O N N N N N C C C C C C C C C C C C C H H H H H H H H H H
charge: 0
multiplicity: 1
keywords: wb97x-d3
keywords: def2-TZVPP
keywords: def2/J RIJCOSX
keywords: DEFGRID2
keywords: scfconv7
keywords: smallprint printgap noloewdin
keywords: NOSOSCF
formula: C13H10Cl2FN5O3S
InChI: InChI=1/C13H10Cl2FN5O3S/c1-2-24-13-17-9(16)6-10-18-12(19-21(10)13)25(22,23)20-11-7(14)4-3-5-8(11)15/h3-6,20H,2H2,1H3
35 atoms
Cl -4.257902 1.029764 1.970383
Cl -0.92122 -1.142713 -1.666252
S  -1.05272 1.967685 0.624058
F  4.85018 -0.095274 -3.180767
O  3.114281 -1.416351 0.775986
O  -1.188986 3.352668 0.241167
O  -1.073555 1.527755 1.998359
N  2.11662 0.231975 -0.369022
N  -2.217397 1.125828 -0.176474
N  1.133718 0.427553 0.518162
N  0.916508 1.831372 -1.248406
N  4.003039 -0.756264 -1.233466
C  0.470789 1.384696 -0.071922
C  1.986178 1.085084 -1.440021
C  3.125628 -0.678202 -0.28771
C  -2.577669 -0.16983 0.232824
C  2.94009 1.011682 -2.466765
C  -3.514559 -0.345425 1.25346
C  -2.044381 -1.312135 -0.366275
C  3.899021 0.067389 -2.275167
C  4.144911 -2.422005 0.927087
C  -3.883032 -1.610049 1.680948
C  -2.41403 -2.582808 0.038536
C  -3.325259 -2.721638 1.071925
C  3.935411 -3.085775 2.260475
H  -2.379582 1.40186 -1.140803
H  2.89512 1.654341 -3.332722
H  4.061546 -3.135234 0.105747
H  5.122174 -1.940943 0.869652
H  -4.605168 -1.727029 2.477008
H  -1.991252 -3.454166 -0.441809
H  -3.612914 -3.711393 1.399527
H  4.031856 -2.378057 3.083759
H  2.9613 -3.570626 2.3242
H  4.698788 -3.853033 2.389216
elementType: Cl S F O N C H
totalener: -2419.40722180 hartree
nucrepener: 2831.33066024 hartree
electener: -5250.73788204 hartree
oneelecener: -8958.37937700 hartree
twoeener: 3707.64149497 hartree
cpcmener: -0.03886530 hartree
kineticenergy: 2412.98559657 hartree
xcener: -162.343798513678 hartree
chargesum: -0.0000000
charge: -0.054933 -0.065177 0.860126 -0.176747 -0.257674 -0.489206 -0.481448 0.165802 -0.240947 -0.291727 -0.326113 -0.369150 0.068963 0.195314 0.452118 0.238932 -0.272280 -0.040713 -0.046701 0.365851 0.039304 -0.078062 -0.091952 -0.166041 -0.244476 0.202608 0.157629 0.110599 0.107688 0.144084 0.146734 0.162187 0.091914 0.091691 0.091804
qa: -0.0549 -0.0652 0.8601 -0.1767 -0.2577 -0.4892 -0.4814 0.1658 -0.2409 -0.2917 -0.3261 -0.3692 0.0690 0.1953 0.4521 0.2389 -0.2723 -0.0407 -0.0467 0.3659 0.0393 -0.0781 -0.0920 -0.1660 -0.2445 0.2026 0.1576 0.1106 0.1077 0.1441 0.1467 0.1622 0.0919 0.0917 0.0918
va: 1.2655 1.2657 5.8628 1.1203 2.2071 2.0234 2.0102 3.3901 3.0392 2.8556 3.1073 3.0180 4.2027 4.0344 4.1748 3.5656 3.9061 4.0535 4.0144 4.2229 3.8082 3.9298 3.9293 3.9579 3.9665 1.0098 1.0066 0.9971 0.9976 1.0050 1.0019 0.9870 1.0036 1.0034 1.0053
dispcorr: -0.019541107 hartree
energy: -2419.426762902915
dipole: 12.79502 -11.77126 1.02376 -19.11512 15.38261 -3.73251 9.83657 -10.79368 -0.95711
magnitude: 3.98695 au
magnitude: 10.13402 debye
