program: Orca
programVersion: 5.0.2
elementType: Cl Cl S F O O O N N N N N C C C C C C C C C C C C C H H H H H H H H H H
charge: 0
multiplicity: 1
keywords: wb97x-d3
keywords: def2-TZVPP
keywords: def2/J RIJCOSX
keywords: DEFGRID2
keywords: scfconv7
keywords: smallprint printgap noloewdin
keywords: NOSOSCF
formula: C13H10Cl2FN5O3S
InChI: InChI=1/C13H10Cl2FN5O3S/c1-2-24-13-17-9(16)6-10-18-12(19-21(10)13)25(22,23)20-11-7(14)4-3-5-8(11)15/h3-6,20H,2H2,1H3
35 atoms
Cl -4.239648 -1.327806 1.616368
Cl -0.757225 1.819027 -1.043455
S  -1.350843 -1.950529 -0.545962
F  4.941443 1.084821 -2.734862
O  2.971212 0.61324 1.304599
O  -1.335017 -2.424721 0.816808
O  -1.672542 -2.800401 -1.668113
N  1.979812 -0.242882 -0.512297
N  -2.387312 -0.668707 -0.619679
N  0.927773 -0.746427 0.143454
N  0.754102 -1.141275 -2.082465
N  3.978142 0.868184 -0.742367
C  0.252328 -1.256425 -0.851511
C  1.877933 -0.486676 -1.860832
C  3.027777 0.442322 0.02294
C  -2.431754 0.282403 0.417082
C  2.909391 -0.033266 -2.697353
C  -3.243225 0.07196 1.533865
C  -1.708516 1.475962 0.355623
C  3.908483 0.622645 -2.04981
C  4.036803 1.351513 1.952577
C  -3.29836 0.994802 2.565563
C  -1.761055 2.412407 1.372411
C  -2.549388 2.156295 2.481785
C  3.743551 1.359192 3.42789
H  -2.606649 -0.355768 -1.56165
H  2.892374 -0.200767 -3.763431
H  4.98852 0.864934 1.735874
H  4.062455 2.362154 1.542729
H  -3.930352 0.813321 3.423644
H  -1.191487 3.328589 1.301401
H  -2.592732 2.879244 3.285118
H  4.529314 1.919235 3.934947
H  2.79281 1.843681 3.650183
H  3.731709 0.351353 3.842622
elementType: Cl S F O N C H
totalener: -2419.40684850 hartree
nucrepener: 2853.05699637 hartree
electener: -5272.46384487 hartree
oneelecener: -9001.67019354 hartree
twoeener: 3729.20634867 hartree
cpcmener: -0.03911757 hartree
kineticenergy: 2412.97889941 hartree
xcener: -162.341632131997 hartree
chargesum: -0.0000000
charge: -0.053861 -0.065822 0.865317 -0.176643 -0.258815 -0.478068 -0.491119 0.165589 -0.227918 -0.302075 -0.314127 -0.367977 0.061861 0.194167 0.453752 0.243209 -0.274287 -0.049445 -0.060085 0.366513 0.038539 -0.074573 -0.080408 -0.171923 -0.244112 0.196553 0.158022 0.108801 0.110494 0.143398 0.147386 0.162396 0.092318 0.090960 0.091985
qa: -0.0539 -0.0658 0.8653 -0.1766 -0.2588 -0.4781 -0.4911 0.1656 -0.2279 -0.3021 -0.3141 -0.3680 0.0619 0.1942 0.4538 0.2432 -0.2743 -0.0494 -0.0601 0.3665 0.0385 -0.0746 -0.0804 -0.1719 -0.2441 0.1966 0.1580 0.1088 0.1105 0.1434 0.1474 0.1624 0.0923 0.0910 0.0920
va: 1.2652 1.2667 5.8559 1.1204 2.2051 2.0160 2.0230 3.3950 3.0431 2.8474 3.1094 3.0192 4.2025 4.0318 4.1716 3.5587 3.9082 4.0591 4.0183 4.2215 3.8086 3.9223 3.9187 3.9598 3.9671 1.0154 1.0064 0.9973 0.9970 1.0055 1.0015 0.9869 1.0054 1.0036 1.0036
dispcorr: -0.019982257 hartree
energy: -2419.426830756647
dipole: 13.85345 -12.25036 1.60309 11.24568 -7.50837 3.73731 18.04928 -16.76702 1.28226
magnitude: 4.26399 au
magnitude: 10.83819 debye
