program: Orca
programVersion: 5.0.2
elementType: Cl Cl S F O O O N N N N N C C C C C C C C C C C C C H H H H H H H H H H
charge: 0
multiplicity: 1
keywords: wb97x-d3
keywords: def2-TZVPP
keywords: def2/J RIJCOSX
keywords: DEFGRID2
keywords: scfconv7
keywords: smallprint printgap noloewdin
keywords: NOSOSCF
formula: C13H10Cl2FN5O3S
InChI: InChI=1/C13H10Cl2FN5O3S/c1-2-24-13-17-9(16)6-10-18-12(19-21(10)13)25(22,23)20-11-7(14)4-3-5-8(11)15/h3-6,20H,2H2,1H3
35 atoms
Cl -4.758808 -1.510315 0.15612
Cl -0.674307 1.772082 1.432347
S  -1.155579 -1.951725 0.392647
F  4.124209 2.358006 -2.346072
O  3.871811 -0.249183 1.340786
O  -0.692994 -2.935319 1.334797
O  -1.881778 -2.252738 -0.809107
N  2.111103 -0.129538 -0.043961
N  -2.070431 -0.875041 1.28098
N  1.343368 -0.988722 0.639637
N  0.250995 -0.213714 -1.190887
N  4.007689 1.08058 -0.524829
C  0.2625 -0.990039 -0.097749
C  1.443232 0.33759 -1.157684
C  3.381257 0.258141 0.250203
C  -2.72945 0.198551 0.660332
C  2.12078 1.237028 -2.001822
C  -3.983875 0.015104 0.073142
C  -2.189585 1.486317 0.650828
C  3.387504 1.541772 -1.613125
C  5.217811 0.092258 1.719031
C  -4.641445 1.068182 -0.543443
C  -2.848836 2.550696 0.063811
C  -4.070485 2.32821 -0.548447
C  6.240487 -0.724804 0.96441
H  -1.682716 -0.701539 2.200406
H  1.658164 1.631558 -2.892169
H  5.378549 1.161589 1.57725
H  5.249195 -0.126263 2.784485
H  -5.60491 0.898868 -1.002671
H  -2.406701 3.536358 0.080994
H  -4.589954 3.149939 -1.022024
H  6.064463 -1.792763 1.088663
H  6.245056 -0.486403 -0.097782
H  7.232708 -0.502156 1.357992
totalener: -2419.37511649 hartree
nucrepener: 2823.09988918 hartree
electener: -5242.47500568 hartree
oneelecener: -8941.34706351 hartree
twoeener: 3698.87205783 hartree
kineticenergy: 2412.99706051 hartree
xcener: -162.337947061376 hartree
chargesum: -0.0000000
charge: -0.025470 -0.072637 0.843393 -0.162598 -0.234064 -0.429284 -0.415037 0.151256 -0.219053 -0.254000 -0.273130 -0.354117 0.031808 0.171584 0.413623 0.225367 -0.268836 -0.053813 -0.057249 0.337723 0.038601 -0.068350 -0.072593 -0.149704 -0.261012 0.153136 0.138503 0.094699 0.113737 0.120543 0.123234 0.130140 0.096282 0.099625 0.087693
qa: -0.0255 -0.0726 0.8434 -0.1626 -0.2341 -0.4293 -0.4150 0.1513 -0.2191 -0.2540 -0.2731 -0.3541 0.0318 0.1716 0.4136 0.2254 -0.2688 -0.0538 -0.0572 0.3377 0.0386 -0.0684 -0.0726 -0.1497 -0.2610 0.1531 0.1385 0.0947 0.1137 0.1205 0.1232 0.1301 0.0963 0.0996 0.0877
va: 1.2944 1.2592 5.8815 1.1398 2.2209 2.0882 2.0889 3.3600 3.0649 2.8362 3.0579 2.9999 4.1750 4.0271 4.1813 3.6091 3.9066 4.1355 4.0393 4.2309 3.8277 3.9606 3.9537 3.9944 3.9292 1.0509 1.0155 1.0111 0.9913 1.0154 1.0087 0.9985 1.0038 1.0100 1.0096
dispcorr: -0.019898668 hartree
energy: -2419.395015161011
dipole: 20.22514 -18.91564 1.30950 3.66350 -1.49937 2.16413 3.28699 -2.88173 0.40526
magnitude: 2.56174 au
magnitude: 6.51142 debye
