program: Orca
programVersion: 5.0.2
elementType: Cl Cl S F O O O N N N N N C C C C C C C C C C C C C H H H H H H H H H H
charge: 0
multiplicity: 1
keywords: wb97x-d3
keywords: def2-TZVPP
keywords: def2/J RIJCOSX
keywords: DEFGRID2
keywords: scfconv7
keywords: smallprint printgap noloewdin
keywords: NOSOSCF
formula: C13H10Cl2FN5O3S
InChI: InChI=1/C13H10Cl2FN5O3S/c1-2-24-13-17-9(16)6-10-18-12(19-21(10)13)25(22,23)20-11-7(14)4-3-5-8(11)15/h3-6,20H,2H2,1H3
35 atoms
Cl -0.798238 1.679594 1.076629
Cl -4.957475 -0.992529 -1.051705
S  -1.06826 -1.461652 -0.362299
F  5.147307 1.805193 -2.472381
O  4.024175 -0.544394 1.221555
O  -1.23621 -1.693087 1.046724
O  -1.178466 -2.494622 -1.362453
N  2.479342 -0.20085 -0.37361
N  -2.094793 -0.227312 -0.817688
N  1.482597 -0.849064 0.249626
N  0.792543 -0.047072 -1.755973
N  4.600894 0.649694 -0.64671
C  0.522266 -0.712887 -0.624333
C  2.050861 0.288362 -1.591444
C  3.752225 -0.013986 0.067258
C  -2.953524 0.392681 0.097021
C  2.971411 1.009613 -2.3733
C  -2.477072 1.316406 1.026826
C  -4.327786 0.148585 0.076088
C  4.208097 1.139711 -1.824496
C  5.363147 -0.403013 1.730513
C  -3.330146 1.95982 1.906532
C  -5.196686 0.805608 0.929306
C  -4.68957 1.705656 1.850217
C  5.432657 -1.15791 3.033668
H  -2.452636 -0.358851 -1.754985
H  2.697252 1.419926 -3.331841
H  6.069848 -0.797404 0.998052
H  5.584811 0.65738 1.865047
H  -2.929078 2.663748 2.621419
H  -6.256213 0.599491 0.879998
H  -5.359543 2.214779 2.529025
H  4.730613 -0.761256 3.765687
H  5.223479 -2.217504 2.894364
H  6.436968 -1.065334 3.445945
totalener: -2419.37734239 hartree
nucrepener: 2762.40772528 hartree
electener: -5181.78506767 hartree
oneelecener: -8820.05266844 hartree
twoeener: 3638.26760077 hartree
kineticenergy: 2413.00655396 hartree
xcener: -162.338765739711 hartree
chargesum: 0.0000000
charge: -0.051571 -0.051015 0.842649 -0.161764 -0.229282 -0.414255 -0.437528 0.137605 -0.234121 -0.255513 -0.295000 -0.344390 0.083187 0.171958 0.407402 0.188064 -0.268579 0.008348 -0.057305 0.339532 0.022216 -0.083415 -0.079005 -0.147743 -0.221775 0.158550 0.137618 0.097923 0.098410 0.121121 0.123027 0.130756 0.091408 0.091126 0.081360
qa: -0.0516 -0.0510 0.8426 -0.1618 -0.2293 -0.4143 -0.4375 0.1376 -0.2341 -0.2555 -0.2950 -0.3444 0.0832 0.1720 0.4074 0.1881 -0.2686 0.0083 -0.0573 0.3395 0.0222 -0.0834 -0.0790 -0.1477 -0.2218 0.1586 0.1376 0.0979 0.0984 0.1211 0.1230 0.1308 0.0914 0.0911 0.0814
va: 1.2740 1.2798 5.8604 1.1400 2.2170 2.0800 2.0657 3.3675 3.0461 2.8188 3.1169 3.0218 4.1325 4.0563 4.1918 3.6615 3.9058 4.0308 4.0839 4.2380 3.8432 3.9907 3.9571 3.9852 3.9554 1.0523 1.0157 1.0007 0.9997 1.0120 1.0112 0.9985 1.0058 1.0062 1.0061
dispcorr: -0.018173907 hartree
energy: -2419.395516296763
dipole: 15.70743 -14.93508 0.77235 -0.51442 1.96435 1.44993 15.66364 -14.95912 0.70452
magnitude: 1.78750 au
magnitude: 4.54347 debye
