program: Orca
programVersion: 5.0.2
elementType: Cl Cl S F O O O N N N N N C C C C C C C C C C C C C H H H H H H H H H H
charge: 0
multiplicity: 1
keywords: wb97x-d3
keywords: def2-TZVPP
keywords: def2/J RIJCOSX
keywords: DEFGRID2
keywords: scfconv7
keywords: smallprint printgap noloewdin
keywords: NOSOSCF
formula: C13H10Cl2FN5O3S
InChI: InChI=1/C13H10Cl2FN5O3S/c1-2-24-13-17-9(16)6-10-18-12(19-21(10)13)25(22,23)20-11-7(14)4-3-5-8(11)15/h3-6,20H,2H2,1H3
35 atoms
Cl -0.479051 0.833749 -2.027896
Cl -4.736686 -0.930565 0.776454
S  -1.196064 -1.794808 0.773838
F  4.121728 3.246922 0.590561
O  3.932388 -1.064404 -0.758536
O  -1.900011 -1.434419 1.972364
O  -0.815938 -3.13644 0.423691
N  2.144292 -0.144916 0.2397
N  -2.072204 -1.225248 -0.531316
N  1.362409 -1.23003 0.148283
N  0.269184 0.467478 1.183036
N  4.041797 1.119179 -0.063608
C  0.272735 -0.792427 0.724616
C  1.47206 0.886281 0.863519
C  3.423592 -0.007228 -0.200876
C  -2.597812 0.077198 -0.529287
C  2.143274 2.11212 1.019649
C  -1.949639 1.135615 -1.170057
C  -3.822061 0.343898 0.088276
C  3.407164 2.137926 0.519832
C  5.301008 -1.017691 -1.202072
C  -2.467865 2.41704 -1.170619
C  -4.339243 1.629627 0.116233
C  -3.657495 2.66015 -0.505353
C  6.270982 -1.219167 -0.060976
H  -1.710737 -1.567831 -1.413292
H  1.669239 2.956746 1.49316
H  5.367176 -1.830889 -1.921751
H  5.48646 -0.07633 -1.720177
H  -1.941734 3.212535 -1.678382
H  -5.281121 1.813272 0.61301
H  -4.065644 3.661209 -0.485609
H  6.238219 -0.395745 0.65024
H  6.075511 -2.152104 0.466387
H  7.283725 -1.268627 -0.461458
totalener: -2419.37465635 hartree
nucrepener: 2838.75384157 hartree
electener: -5258.12849792 hartree
oneelecener: -8972.59652113 hartree
twoeener: 3714.46802321 hartree
kineticenergy: 2413.01471899 hartree
xcener: -162.341499908913 hartree
chargesum: 0.0000000
charge: -0.074847 -0.025530 0.844285 -0.162526 -0.234074 -0.414105 -0.430639 0.156147 -0.214391 -0.253794 -0.280631 -0.353150 0.041259 0.158039 0.414021 0.233324 -0.264053 -0.058989 -0.064422 0.337698 0.039271 -0.066018 -0.065014 -0.154681 -0.261584 0.151849 0.137215 0.113640 0.095755 0.122068 0.120216 0.130375 0.098994 0.096718 0.087574
qa: -0.0748 -0.0255 0.8443 -0.1625 -0.2341 -0.4141 -0.4306 0.1561 -0.2144 -0.2538 -0.2806 -0.3532 0.0413 0.1580 0.4140 0.2333 -0.2641 -0.0590 -0.0644 0.3377 0.0393 -0.0660 -0.0650 -0.1547 -0.2616 0.1518 0.1372 0.1136 0.0958 0.1221 0.1202 0.1304 0.0990 0.0967 0.0876
va: 1.2590 1.2943 5.8788 1.1401 2.2220 2.0888 2.0871 3.3514 3.0694 2.8325 3.0488 2.9975 4.1687 4.0345 4.1794 3.5913 3.9029 4.0442 4.1435 4.2309 3.8264 3.9481 3.9569 3.9999 3.9308 1.0528 1.0159 0.9914 1.0110 1.0088 1.0154 0.9984 1.0099 1.0038 1.0097
dispcorr: -0.020295662 hartree
energy: -2419.394952013703
dipole: 20.97910 -19.48387 1.49524 0.80686 0.83202 1.63888 -3.17046 1.85264 -1.31782
magnitude: 2.58037 au
magnitude: 6.55878 debye
