program: Orca
programVersion: 5.0.2
elementType: Cl Cl S F O O O N N N N N C C C C C C C C C C C C C H H H H H H H H H H
charge: 0
multiplicity: 1
keywords: wb97x-d3
keywords: def2-TZVPP
keywords: def2/J RIJCOSX
keywords: DEFGRID2
keywords: scfconv7
keywords: smallprint printgap noloewdin
keywords: NOSOSCF
formula: C13H10Cl2FN5O3S
InChI: InChI=1/C13H10Cl2FN5O3S/c1-2-24-13-17-9(16)6-10-18-12(19-21(10)13)25(22,23)20-11-7(14)4-3-5-8(11)15/h3-6,20H,2H2,1H3
35 atoms
Cl -0.452569 2.084775 -0.091029
Cl -4.668824 -1.272262 -0.01673
S  -1.395596 -1.451344 -1.45669
F  5.316093 1.481888 -1.855715
O  3.175288 -0.844217 1.373351
O  -1.657813 -2.298393 -0.325246
O  -1.598418 -1.832912 -2.827561
N  2.123506 -0.439428 -0.567999
N  -2.255673 -0.044907 -1.217233
N  0.987434 -1.074635 -0.244552
N  0.857156 -0.200458 -2.33353
N  4.262802 0.34643 -0.257155
C  0.289393 -0.892782 -1.333983
C  2.038957 0.089276 -1.840807
C  3.236865 -0.294293 0.198274
C  -2.550859 0.394589 0.081478
C  3.155519 0.784308 -2.341665
C  -1.793564 1.37077 0.730066
C  -3.653106 -0.132109 0.760048
C  4.211426 0.857538 -1.488238
C  4.309864 -0.716999 2.24972
C  -2.103842 1.805196 2.006494
C  -3.960948 0.27763 2.047175
C  -3.183444 1.241638 2.66436
C  4.325784 0.617889 2.958121
H  -2.124834 0.65103 -1.940847
H  3.155173 1.214197 -3.330411
H  4.18633 -1.536056 2.954986
H  5.229123 -0.878001 1.68559
H  -1.500851 2.566787 2.479538
H  -4.811819 -0.152353 2.555667
H  -3.427301 1.564889 3.667023
H  5.147393 0.629582 3.674538
H  4.481436 1.442321 2.264612
H  3.400869 0.785731 3.508421
totalener: -2419.37510215 hartree
nucrepener: 2833.49675607 hartree
electener: -5252.87185821 hartree
oneelecener: -8962.05583150 hartree
twoeener: 3709.18397328 hartree
kineticenergy: 2413.00993151 hartree
xcener: -162.341140412855 hartree
chargesum: -0.0000000
charge: -0.068384 -0.027649 0.837203 -0.162291 -0.233152 -0.421245 -0.422469 0.152682 -0.231217 -0.253866 -0.279950 -0.356383 0.056346 0.153652 0.417061 0.197876 -0.265040 -0.035153 -0.031403 0.336632 0.039461 -0.089199 -0.069816 -0.144513 -0.262258 0.158036 0.139254 0.114535 0.095581 0.122876 0.120896 0.130571 0.088343 0.099527 0.093453
qa: -0.0684 -0.0276 0.8372 -0.1623 -0.2332 -0.4212 -0.4225 0.1527 -0.2312 -0.2539 -0.2799 -0.3564 0.0563 0.1537 0.4171 0.1979 -0.2650 -0.0352 -0.0314 0.3366 0.0395 -0.0892 -0.0698 -0.1445 -0.2623 0.1580 0.1393 0.1145 0.0956 0.1229 0.1209 0.1306 0.0883 0.0995 0.0935
va: 1.2651 1.2936 5.8828 1.1404 2.2223 2.0760 2.0978 3.3476 3.0552 2.8092 3.1013 2.9979 4.1617 4.0505 4.1766 3.6565 3.9021 4.0264 4.1176 4.2358 3.8267 3.9685 3.9669 3.9873 3.9297 1.0446 1.0155 0.9915 1.0120 1.0100 1.0150 0.9984 1.0097 1.0101 1.0039
dispcorr: -0.019883439 hartree
energy: -2419.394985587404
dipole: 14.57998 -13.24829 1.33169 3.65029 -1.97550 1.67479 19.44885 -17.50786 1.94099
magnitude: 2.88890 au
magnitude: 7.34301 debye
