program: Orca
programVersion: 5.0.2
elementType: Cl Cl S F O O O N N N N N C C C C C C C C C C C C C H H H H H H H H H H
charge: 0
multiplicity: 1
keywords: wb97x-d3
keywords: def2-TZVPP
keywords: def2/J RIJCOSX
keywords: DEFGRID2
keywords: scfconv7
keywords: smallprint printgap noloewdin
keywords: NOSOSCF
formula: C13H10Cl2FN5O3S
InChI: InChI=1/C13H10Cl2FN5O3S/c1-2-24-13-17-9(16)6-10-18-12(19-21(10)13)25(22,23)20-11-7(14)4-3-5-8(11)15/h3-6,20H,2H2,1H3
35 atoms
Cl -0.980591 2.046864 0.244827
Cl -4.337072 -2.023439 1.324741
S  -1.240478 -1.146654 -1.015946
F  5.510944 1.507652 -2.093632
O  3.521003 -0.469461 1.452376
O  -1.142199 -2.579986 -1.146085
O  -2.014407 -0.315754 -1.898298
N  2.351043 -0.168277 -0.438386
N  -1.722222 -0.82505 0.554093
N  1.207566 -0.697343 0.01908
N  0.959225 0.026007 -2.11445
N  4.542532 0.527187 -0.341877
C  0.433323 -0.540238 -1.022329
C  2.194612 0.269477 -1.737271
C  3.524277 -0.023147 0.231864
C  -2.751771 0.091645 0.800109
C  3.30039 0.865082 -2.369347
C  -2.534173 1.464827 0.693759
C  -4.023017 -0.332852 1.188986
C  4.418567 0.953097 -1.601054
C  4.730876 -0.354225 2.221193
C  -3.54422 2.376269 0.947346
C  -5.035083 0.567159 1.472314
C  -4.791653 1.922964 1.339643
C  4.439128 -0.893591 3.598697
H  -1.724645 -1.661572 1.123779
H  3.243106 1.225231 -3.383996
H  5.524806 -0.917155 1.726638
H  5.03938 0.692251 2.254885
H  -3.347465 3.433684 0.844202
H  -6.006981 0.204963 1.774883
H  -5.580309 2.632975 1.545741
H  4.125588 -1.935897 3.56265
H  5.342296 -0.835028 4.204925
H  3.661805 -0.316597 4.097667
totalener: -2419.37557737 hartree
nucrepener: 2773.24237789 hartree
electener: -5192.61795526 hartree
oneelecener: -8841.62996007 hartree
twoeener: 3649.01200481 hartree
kineticenergy: 2413.01583550 hartree
xcener: -162.339390890628 hartree
chargesum: -0.0000000
charge: -0.050881 -0.053965 0.846720 -0.161553 -0.232581 -0.438766 -0.408922 0.125067 -0.229490 -0.268676 -0.265856 -0.343321 0.068385 0.181412 0.404933 0.188495 -0.267558 -0.003384 -0.050930 0.340746 0.023257 -0.080015 -0.078048 -0.148929 -0.224733 0.153972 0.140093 0.099374 0.098060 0.121154 0.122384 0.130350 0.090832 0.082871 0.089503
qa: -0.0509 -0.0540 0.8467 -0.1616 -0.2326 -0.4388 -0.4089 0.1251 -0.2295 -0.2687 -0.2659 -0.3433 0.0684 0.1814 0.4049 0.1885 -0.2676 -0.0034 -0.0509 0.3407 0.0233 -0.0800 -0.0780 -0.1489 -0.2247 0.1540 0.1401 0.0994 0.0981 0.1212 0.1224 0.1303 0.0908 0.0829 0.0895
va: 1.2749 1.2768 5.8409 1.1401 2.2130 2.0623 2.0843 3.4206 3.0468 2.8567 3.0960 3.0239 4.1641 4.0336 4.1965 3.6749 3.9051 4.0361 4.0812 4.2319 3.8429 3.9902 3.9583 3.9854 3.9560 1.0565 1.0148 1.0000 1.0004 1.0118 1.0108 0.9986 1.0057 1.0068 1.0058
dispcorr: -0.018202918 hartree
energy: -2419.393780288726
dipole: 11.75931 -10.83114 0.92817 0.88782 -0.00620 0.88161 16.30217 -14.21752 2.08464
magnitude: 2.44632 au
magnitude: 6.21805 debye
