program: Orca
programVersion: 5.0.2
elementType: Cl S F O O O O O N N N N N C C C C C C C C C C C C C C C H H H H H H H H H H H H H
charge: 0
multiplicity: 1
keywords: wb97x-d3
keywords: def2-TZVPP
keywords: def2/J RIJCOSX
keywords: DEFGRID2
keywords: scfconv7
keywords: smallprint printgap noloewdin
keywords: NOSOSCF
formula: C15H13ClFN5O5S
InChI: InChI=1/C15H13ClFN5O5S/c1-3-27-15-18-10(17)7-11-19-14(20-22(11)15)28(24,25)21-12-8(13(23)26-2)5-4-6-9(12)16/h4-7,21H,3H2,1-2H3
41 atoms
Cl 4.708085 0.572993 1.792412
S  1.127845 0.835952 1.852703
F  -4.149207 0.981162 -3.200094
O  -3.973356 -0.638129 1.016365
O  0.69215 0.582508 3.208297
O  1.882081 2.016454 1.496691
O  0.449764 -1.36002 -2.390766
O  0.382294 -2.07455 -0.280307
N  -2.183274 0.400278 0.15779
N  1.997541 -0.48334 1.372736
N  -1.415846 0.254871 1.245505
N  -0.283771 1.32339 -0.407953
N  -4.080548 0.182387 -1.126087
C  -0.318182 0.819525 0.826269
C  -1.498319 1.043571 -0.841189
C  2.770576 -0.425887 0.190981
C  2.297867 -0.875035 -1.052177
C  -3.466428 -0.031105 -0.008364
C  4.065708 0.082203 0.271622
C  -2.154981 1.280111 -2.056623
C  3.119774 -0.795966 -2.171882
C  4.877066 0.16469 -0.849153
C  -3.43132 0.81618 -2.101795
C  4.398762 -0.275651 -2.069532
C  0.948487 -1.49418 -1.179333
C  -5.332142 -1.139843 0.924024
C  -5.65028 -1.821662 2.225946
C  -0.791254 -2.014343 -2.678905
H  1.511438 -1.361668 1.537558
H  -1.669506 1.783129 -2.878568
H  2.772425 -1.153445 -3.130427
H  5.88002 0.559745 -0.764183
H  5.032243 -0.222502 -2.943826
H  -6.002419 -0.301083 0.73592
H  -5.393476 -1.833201 0.085132
H  -6.667313 -2.208819 2.171696
H  -4.983303 -2.661824 2.415877
H  -5.600633 -1.131206 3.067233
H  -1.582474 -1.703382 -1.996389
H  -0.676677 -3.097968 -2.633783
H  -1.050759 -1.71945 -3.691609
elementType: Cl S F O N C H
totalener: -2187.70569421 hartree
nucrepener: 3205.64320360 hartree
electener: -5393.34889780 hartree
oneelecener: -9381.17289593 hartree
twoeener: 3987.82399813 hartree
cpcmener: -0.05532762 hartree
kineticenergy: 2181.02761591 hartree
xcener: -161.664138450463 hartree
chargesum: 0.0000000
charge: -0.060477 0.864794 -0.177089 -0.266122 -0.506821 -0.492193 -0.273729 -0.458333 0.189743 -0.214037 -0.300884 -0.334151 -0.372931 0.079391 0.191212 0.115249 -0.006996 0.467267 0.016507 -0.281013 -0.161846 -0.093208 0.384087 -0.147064 0.476823 0.041430 -0.248036 -0.130283 0.197862 0.156516 0.150848 0.145345 0.165274 0.111872 0.110733 0.093536 0.092274 0.092208 0.101681 0.144455 0.136108
qa: -0.0605 0.8648 -0.1771 -0.2661 -0.5068 -0.4922 -0.2737 -0.4583 0.1897 -0.2140 -0.3009 -0.3342 -0.3729 0.0794 0.1912 0.1152 -0.0070 0.4673 0.0165 -0.2810 -0.1618 -0.0932 0.3841 -0.1471 0.4768 0.0414 -0.2480 -0.1303 0.1979 0.1565 0.1508 0.1453 0.1653 0.1119 0.1107 0.0935 0.0923 0.0922 0.1017 0.1445 0.1361
va: 1.2596 5.8385 1.1213 2.2073 1.9956 2.0001 2.1180 2.0280 3.3950 3.0409 2.9006 3.0646 3.0001 4.1911 3.9984 3.8164 3.6712 4.1469 4.0376 3.8710 3.9843 3.9720 4.1998 3.9388 4.0657 3.8028 3.9674 3.8398 1.0311 1.0086 1.0163 1.0054 0.9880 0.9967 0.9971 1.0054 1.0032 1.0031 0.9945 0.9950 0.9917
dispcorr: -0.025032409 hartree
energy: -2187.730726615986
dipole: -20.09695 17.98596 -2.11099 -15.70674 13.51255 -2.19419 -6.81579 3.05641 -3.75939
magnitude: 4.83774 au
magnitude: 12.29657 debye
