program: Orca
programVersion: 5.0.2
elementType: Cl S F O O O O O N N N N N C C C C C C C C C C C C C C C H H H H H H H H H H H H H
charge: 0
multiplicity: 1
keywords: wb97x-d3
keywords: def2-TZVPP
keywords: def2/J RIJCOSX
keywords: DEFGRID2
keywords: scfconv7
keywords: smallprint printgap noloewdin
keywords: NOSOSCF
formula: C15H13ClFN5O5S
InChI: InChI=1/C15H13ClFN5O5S/c1-3-27-15-18-10(17)7-11-19-14(20-22(11)15)28(24,25)21-12-8(13(23)26-2)5-4-6-9(12)16/h4-7,21H,3H2,1-2H3
41 atoms
Cl 4.692099 0.600627 1.783126
S  1.110933 0.877294 1.847289
F  -4.141578 0.913702 -3.234169
O  -3.985461 -0.614188 1.016242
O  0.67555 0.630572 3.20372
O  1.867902 2.054345 1.486197
O  0.426581 -1.352534 -2.387858
O  0.357979 -2.045892 -0.271022
N  -2.196955 0.420768 0.150373
N  1.976468 -0.446162 1.371471
N  -1.432485 0.291756 1.241622
N  -0.300761 1.347724 -0.419275
N  -4.082862 0.162033 -1.142781
C  -0.33584 0.856967 0.820492
C  -1.511774 1.055814 -0.854431
C  2.748622 -0.397804 0.188974
C  2.272679 -0.851364 -1.051353
C  -3.475393 -0.023387 -0.016542
C  4.046501 0.103532 0.266104
C  -2.163443 1.267395 -2.07719
C  3.094627 -0.783698 -2.171857
C  4.858045 0.173802 -0.85536
C  -3.432801 0.784346 -2.125337
C  4.376837 -0.271036 -2.072869
C  0.923269 -1.470571 -1.173224
C  -5.342302 -1.119281 0.928675
C  -5.663384 -1.777256 2.242216
C  -0.808136 -2.018858 -2.67101
H  1.488575 -1.322014 1.542561
H  -1.676931 1.760786 -2.90439
H  2.744576 -1.144922 -3.127949
H  5.863474 0.562869 -0.77299
H  5.010448 -0.2272 -2.947528
H  -6.013547 -0.285299 0.723533
H  -5.400779 -1.827771 0.102403
H  -6.680591 -2.164336 2.19377
H  -4.997101 -2.614005 2.448539
H  -5.614295 -1.071443 3.070725
H  -0.690364 -3.099413 -2.602265
H  -1.062485 -1.74744 -3.690174
H  -1.605367 -1.698506 -2.002637
elementType: Cl S F O N C H
totalener: -2187.70566966 hartree
nucrepener: 3207.10361550 hartree
electener: -5394.80928516 hartree
oneelecener: -9384.07522959 hartree
twoeener: 3989.26594443 hartree
cpcmener: -0.05512348 hartree
kineticenergy: 2181.03823805 hartree
xcener: -161.666516476204 hartree
chargesum: 0.0000000
charge: -0.060272 0.864929 -0.177048 -0.265920 -0.506258 -0.492256 -0.274629 -0.457565 0.189324 -0.213777 -0.301159 -0.334823 -0.373436 0.079984 0.190800 0.113998 -0.006323 0.467259 0.017657 -0.278971 -0.162361 -0.093840 0.383669 -0.146535 0.477415 0.041677 -0.248046 -0.130649 0.197622 0.156313 0.150819 0.145213 0.165268 0.111872 0.110296 0.093470 0.092226 0.092152 0.144099 0.136130 0.101677
qa: -0.0603 0.8649 -0.1770 -0.2659 -0.5063 -0.4923 -0.2746 -0.4576 0.1893 -0.2138 -0.3012 -0.3348 -0.3734 0.0800 0.1908 0.1140 -0.0063 0.4673 0.0177 -0.2790 -0.1624 -0.0938 0.3837 -0.1465 0.4774 0.0417 -0.2480 -0.1306 0.1976 0.1563 0.1508 0.1452 0.1653 0.1119 0.1103 0.0935 0.0922 0.0922 0.1441 0.1361 0.1017
va: 1.2599 5.8390 1.1214 2.2074 1.9963 2.0002 2.1173 2.0287 3.3959 3.0412 2.9008 3.0647 2.9990 4.1910 3.9994 3.8178 3.6707 4.1471 4.0377 3.8698 3.9844 3.9727 4.1988 3.9383 4.0624 3.8032 3.9674 3.8403 1.0313 1.0087 1.0165 1.0055 0.9880 0.9967 0.9971 1.0054 1.0032 1.0031 0.9953 0.9918 0.9945
dispcorr: -0.025085488 hartree
energy: -2187.730755151806
dipole: -20.12199 18.01885 -2.10314 -15.68665 13.46504 -2.22161 -6.66213 2.92336 -3.73877
magnitude: 4.83085 au
magnitude: 12.27905 debye
