program: Orca
programVersion: 5.0.2
elementType: Cl S F O O O O O N N N N N C C C C C C C C C C C C C C C H H H H H H H H H H H H H
charge: 0
multiplicity: 1
keywords: wb97x-d3
keywords: def2-TZVPP
keywords: def2/J RIJCOSX
keywords: DEFGRID2
keywords: scfconv7
keywords: smallprint printgap noloewdin
keywords: NOSOSCF
formula: C15H13ClFN5O5S
InChI: InChI=1/C15H13ClFN5O5S/c1-3-27-15-18-10(17)7-11-19-14(20-22(11)15)28(24,25)21-12-8(13(23)26-2)5-4-6-9(12)16/h4-7,21H,3H2,1-2H3
41 atoms
Cl 4.725824 0.763113 1.601236
S  1.152984 0.984392 1.85137
F  -4.179215 0.820715 -3.13838
O  -4.043856 -0.239081 1.259568
O  0.753406 0.757947 3.222191
O  1.897554 2.157894 1.455096
O  0.281392 -1.435164 -2.258842
O  0.346443 -2.042655 -0.116954
N  -2.210701 0.557948 0.256832
N  2.008317 -0.348974 1.375094
N  -1.432452 0.483565 1.344591
N  -0.278592 1.323121 -0.421686
N  -4.134352 0.296435 -0.977335
C  -0.315904 0.946983 0.857875
C  -1.51024 1.056624 -0.812045
C  2.716575 -0.327333 0.151496
C  2.18576 -0.835823 -1.045492
C  -3.520132 0.188777 0.155496
C  4.004366 0.205242 0.139932
C  -2.168718 1.180772 -2.042437
C  2.942069 -0.782876 -2.212629
C  4.74983 0.259569 -1.028338
C  -3.463561 0.768287 -2.02716
C  4.213283 -0.233777 -2.203373
C  0.848102 -1.491909 -1.071179
C  -5.433073 -0.654243 1.282723
C  -5.606693 -2.063602 0.777538
C  -0.954487 -2.135428 -2.440546
H  1.516122 -1.217867 1.574574
H  -1.669678 1.558371 -2.921515
H  2.548888 -1.183358 -3.135975
H  5.748125 0.674956 -1.014134
H  4.795321 -0.201128 -3.1144
H  -5.702895 -0.578877 2.333009
H  -6.033761 0.061239 0.722567
H  -4.989081 -2.765729 1.337261
H  -6.648695 -2.351744 0.918975
H  -5.37698 -2.158726 -0.282594
H  -0.810621 -3.210505 -2.330018
H  -1.271628 -1.915515 -3.4558
H  -1.718654 -1.797106 -1.741542
elementType: Cl S F O N C H
totalener: -2187.70400172 hartree
nucrepener: 3218.24284863 hartree
electener: -5405.94685035 hartree
oneelecener: -9406.29278173 hartree
twoeener: 4000.34593138 hartree
cpcmener: -0.05429385 hartree
kineticenergy: 2181.01980981 hartree
xcener: -161.664067730495 hartree
chargesum: -0.0000000
charge: -0.060785 0.866100 -0.177898 -0.270895 -0.507018 -0.491183 -0.275003 -0.459084 0.188177 -0.213425 -0.297737 -0.338541 -0.374990 0.082084 0.189840 0.117000 -0.009712 0.468345 0.012727 -0.278239 -0.160480 -0.093297 0.381981 -0.148503 0.478661 0.054099 -0.258416 -0.135184 0.198272 0.157010 0.150586 0.144984 0.165217 0.121055 0.100961 0.092796 0.101283 0.091945 0.144585 0.136824 0.105858
qa: -0.0608 0.8661 -0.1779 -0.2709 -0.5070 -0.4912 -0.2750 -0.4591 0.1882 -0.2134 -0.2977 -0.3385 -0.3750 0.0821 0.1898 0.1170 -0.0097 0.4683 0.0127 -0.2782 -0.1605 -0.0933 0.3820 -0.1485 0.4787 0.0541 -0.2584 -0.1352 0.1983 0.1570 0.1506 0.1450 0.1652 0.1211 0.1010 0.0928 0.1013 0.0919 0.1446 0.1368 0.1059
va: 1.2588 5.8346 1.1210 2.2065 1.9965 2.0002 2.1173 2.0272 3.3982 3.0418 2.9049 3.0587 2.9898 4.1877 3.9996 3.8177 3.6634 4.1444 4.0388 3.8624 3.9843 3.9703 4.1963 3.9396 4.0563 3.8129 3.9311 3.8392 1.0336 1.0089 1.0168 1.0056 0.9881 0.9923 1.0090 1.0044 1.0057 1.0095 0.9954 0.9908 0.9930
dispcorr: -0.025570597 hartree
energy: -2187.729572318042
dipole: -20.77816 18.40970 -2.36845 -16.69852 14.47209 -2.22643 -9.33128 5.64342 -3.68786
magnitude: 4.91598 au
magnitude: 12.49544 debye
