program: Orca
programVersion: 5.0.2
elementType: Cl S F O O O O O N N N N N C C C C C C C C C C C C C C C H H H H H H H H H H H H H
charge: 0
multiplicity: 1
keywords: wb97x-d3
keywords: def2-TZVPP
keywords: def2/J RIJCOSX
keywords: DEFGRID2
keywords: scfconv7
keywords: smallprint printgap noloewdin
keywords: NOSOSCF
formula: C15H13ClFN5O5S
InChI: InChI=1/C15H13ClFN5O5S/c1-3-27-15-18-10(17)7-11-19-14(20-22(11)15)28(24,25)21-12-8(13(23)26-2)5-4-6-9(12)16/h4-7,21H,3H2,1-2H3
41 atoms
Cl 4.732889 1.415755 1.062421
S  1.188267 1.401149 1.462297
F  -4.340062 -3.104477 -0.104979
O  -3.947478 1.406968 -0.061385
O  1.957297 0.598452 2.386108
O  0.827243 2.772466 1.743081
O  0.351057 -1.837205 -2.046624
O  0.284486 0.388046 -1.967732
N  -2.218395 0.138074 0.567068
N  1.986181 1.395923 0.018934
N  -1.392276 1.166131 0.795727
N  -0.349512 -0.812981 1.186459
N  -4.170755 -0.885624 -0.090527
C  -0.316854 0.519573 1.148393
C  -1.586998 -1.05692 0.799527
C  2.738308 0.261719 -0.356727
C  2.227261 -0.755846 -1.176714
C  -3.503035 0.202841 0.114394
C  4.047718 0.155475 0.108721
C  -2.305539 -2.241448 0.591339
C  3.028176 -1.847029 -1.498393
C  4.83759 -0.937271 -0.210504
C  -3.575334 -2.054323 0.144116
C  4.321744 -1.937269 -1.014021
C  0.858458 -0.655965 -1.756359
C  -5.270576 1.608083 -0.618753
C  -5.262126 1.485933 -2.121028
C  -0.912094 -1.868346 -2.720203
H  1.485049 1.87349 -0.725715
H  -1.864876 -3.212129 0.758625
H  2.651682 -2.630563 -2.139633
H  5.851606 -0.999343 0.159332
H  4.937686 -2.787155 -1.272156
H  -5.970964 0.916988 -0.152073
H  -5.528196 2.617695 -0.308972
H  -5.016545 0.479434 -2.456456
H  -6.259705 1.724159 -2.490451
H  -4.563028 2.18852 -2.573225
H  -1.180048 -2.916886 -2.796116
H  -0.82921 -1.441113 -3.718718
H  -1.682661 -1.338002 -2.163779
elementType: Cl S F O N C H
totalener: -2187.70392664 hartree
nucrepener: 3216.36558003 hartree
electener: -5404.06950667 hartree
oneelecener: -9402.66347153 hartree
twoeener: 3998.59396487 hartree
cpcmener: -0.05481339 hartree
kineticenergy: 2181.05357588 hartree
xcener: -161.670639540658 hartree
chargesum: 0.0000000
charge: -0.060865 0.863108 -0.177797 -0.271894 -0.494392 -0.506251 -0.274410 -0.457678 0.185132 -0.213420 -0.301672 -0.336878 -0.374719 0.083924 0.196186 0.113400 -0.003969 0.468496 0.017023 -0.284740 -0.161525 -0.090263 0.384830 -0.148016 0.472884 0.053984 -0.257409 -0.121877 0.198049 0.156280 0.152809 0.144583 0.165079 0.101731 0.120397 0.091614 0.100730 0.093606 0.135485 0.142856 0.095590
qa: -0.0609 0.8631 -0.1778 -0.2719 -0.4944 -0.5063 -0.2744 -0.4577 0.1851 -0.2134 -0.3017 -0.3369 -0.3747 0.0839 0.1962 0.1134 -0.0040 0.4685 0.0170 -0.2847 -0.1615 -0.0903 0.3848 -0.1480 0.4729 0.0540 -0.2574 -0.1219 0.1980 0.1563 0.1528 0.1446 0.1651 0.1017 0.1204 0.0916 0.1007 0.0936 0.1355 0.1429 0.0956
va: 1.2593 5.8416 1.1214 2.2052 1.9966 1.9962 2.1190 2.0279 3.3973 3.0437 2.9050 3.0636 2.9884 4.1966 3.9937 3.8175 3.6749 4.1455 4.0343 3.8648 3.9820 3.9711 4.1910 3.9401 4.0750 3.8126 3.9344 3.8407 1.0290 1.0089 1.0156 1.0056 0.9881 1.0088 0.9924 1.0087 1.0060 1.0044 0.9928 0.9951 0.9969
dispcorr: -0.025433306 hartree
energy: -2187.729359946354
dipole: -19.32917 17.09100 -2.23817 -3.92078 1.28914 -2.63164 -19.89493 16.47417 -3.42076
magnitude: 4.86175 au
magnitude: 12.35758 debye
