program: Orca
programVersion: 5.0.2
elementType: Cl S F O O O O O N N N N N C C C C C C C C C C C C C C C H H H H H H H H H H H H H
charge: 0
multiplicity: 1
keywords: wb97x-d3
keywords: def2-TZVPP
keywords: def2/J RIJCOSX
keywords: DEFGRID2
keywords: scfconv7
keywords: smallprint printgap noloewdin
keywords: NOSOSCF
formula: C15H13ClFN5O5S
InChI: InChI=1/C15H13ClFN5O5S/c1-3-27-15-18-10(17)7-11-19-14(20-22(11)15)28(24,25)21-12-8(13(23)26-2)5-4-6-9(12)16/h4-7,21H,3H2,1-2H3
41 atoms
Cl 4.725306 0.633271 1.757451
S  1.142373 0.845381 1.856761
F  -4.219127 0.773495 -3.103751
O  -3.873504 -0.876111 1.096629
O  0.74068 0.579853 3.220593
O  1.864897 2.041811 1.487934
O  0.468929 -1.351253 -2.409362
O  0.409937 -2.04956 -0.294265
N  -2.17736 0.290381 0.222334
N  2.026716 -0.45594 1.35548
N  -1.382633 0.169161 1.292507
N  -0.340272 1.321328 -0.363639
N  -4.07306 -0.037332 -1.037803
C  -0.324216 0.796341 0.86208
C  -1.546569 0.984102 -0.778657
C  2.787639 -0.382394 0.16724
C  2.310069 -0.831135 -1.074283
C  -3.432634 -0.21994 0.070603
C  4.078883 0.136526 0.240516
C  -2.237289 1.197291 -1.978968
C  3.1246 -0.743397 -2.198837
C  4.883516 0.225398 -0.884526
C  -3.480093 0.647919 -2.01428
C  4.401067 -0.21605 -2.102819
C  0.967767 -1.465751 -1.195908
C  -5.20991 -1.439339 1.059416
C  -6.256408 -0.408899 1.397238
C  -0.754216 -2.037613 -2.696188
H  1.560466 -1.343991 1.524591
H  -1.798219 1.741234 -2.800959
H  2.774331 -1.10036 -3.1564
H  5.88452 0.626257 -0.804989
H  5.029492 -0.15777 -2.980374
H  -5.382264 -1.89804 0.086724
H  -5.177404 -2.226426 1.808557
H  -6.313107 0.386797 0.655961
H  -7.227467 -0.90347 1.42799
H  -6.077455 0.033936 2.376413
H  -1.559715 -1.72619 -2.032322
H  -0.620079 -3.116537 -2.62184
H  -1.007282 -1.773962 -3.718784
elementType: Cl S F O N C H
totalener: -2187.70397196 hartree
nucrepener: 3211.19717938 hartree
electener: -5398.90115134 hartree
oneelecener: -9392.30613497 hartree
twoeener: 3993.40498363 hartree
cpcmener: -0.05490515 hartree
kineticenergy: 2181.03842976 hartree
xcener: -161.667472550906 hartree
chargesum: 0.0000000
charge: -0.060371 0.864716 -0.177688 -0.271519 -0.507100 -0.492657 -0.274192 -0.458310 0.186752 -0.213850 -0.300905 -0.334341 -0.378335 0.079883 0.191612 0.111922 -0.003902 0.471820 0.019094 -0.277871 -0.162477 -0.094364 0.380709 -0.145910 0.476845 0.054775 -0.258112 -0.126121 0.197476 0.156532 0.151097 0.145448 0.165238 0.101556 0.120186 0.091598 0.100610 0.093268 0.098022 0.143085 0.135779
qa: -0.0604 0.8647 -0.1777 -0.2715 -0.5071 -0.4927 -0.2742 -0.4583 0.1868 -0.2139 -0.3009 -0.3343 -0.3783 0.0799 0.1916 0.1119 -0.0039 0.4718 0.0191 -0.2779 -0.1625 -0.0944 0.3807 -0.1459 0.4768 0.0548 -0.2581 -0.1261 0.1975 0.1565 0.1511 0.1454 0.1652 0.1016 0.1202 0.0916 0.1006 0.0933 0.0980 0.1431 0.1358
va: 1.2599 5.8383 1.1216 2.2075 1.9947 2.0002 2.1187 2.0277 3.3980 3.0410 2.9018 3.0668 2.9824 4.1955 4.0018 3.8217 3.6748 4.1393 4.0374 3.8663 3.9831 3.9733 4.1933 3.9372 4.0639 3.8117 3.9330 3.8407 1.0308 1.0088 1.0163 1.0054 0.9881 1.0097 0.9925 1.0097 1.0056 1.0042 0.9953 0.9952 0.9924
dispcorr: -0.025415455 hartree
energy: -2187.729387413272
dipole: -21.33068 19.19849 -2.13219 -12.33832 10.11821 -2.22012 -8.83191 5.08355 -3.74835
magnitude: 4.85029 au
magnitude: 12.32845 debye
