program: Gaussian 09
title: 000068881
version: EM64L-G09RevD.01
frameworkgroup: C1[X(C14H22ClN3O3S)]
method: RPBEPBE
basis: SDD
operation: Freq
keyword: #p
keyword: freq=noraman
keyword: PBEPBE/SDD
title: #p freq=noraman PBEPBE/SDD
converged: YES YES NO NO
title: Mulliken charges:
elementType: Cl S O O O N N N C C C C C C C C C C C C C C H H H H H H H H H H H H H H H H H H H H H H
charge: -0.053376 0.982986 -0.548673 -0.518693 -0.292668 -0.119936 -0.500450 -0.685739 -0.014875 -0.459910 -0.477159 -0.365782 -0.436279 -0.328695 -0.694561 -0.317528 0.464047 -0.230769 -0.510051 -0.362308 0.691684 -0.527794 0.205139 0.205292 0.266853 0.226701 0.224169 0.228009 0.175060 0.225889 0.277743 0.180303 0.203747 0.316740 0.225366 0.225554 0.206708 0.314954 0.243556 0.327322 0.315501 0.236844 0.254397 0.220681
chargesum: 0.00000
title: Mulliken charges with hydrogens summed into heavy atoms:
elementType: Cl S O O O N N N C C C C C C C C C C C C C C
charge: -0.053376 0.982986 -0.548673 -0.518693 -0.292668 -0.119936 -0.183710 -0.042915 0.190265 0.012235 -0.026289 0.037287 0.067353 0.055355 -0.036934 -0.317528 0.464047 0.084185 -0.266495 -0.362308 0.691684 0.184129
polarizability: 2.73746788e+02 3.10697117e+01 2.09195740e+02 7.22896229e+00 -9.14107010e+00 2.11351600e+02
1716.lowfreq: -12.9102 -5.5788 -4.3191 -0.0021 -0.0017 -0.0009 6.0501 14.8337 22.4969
frequency: -8.7231 13.8695 22.3703 45.6161 59.3523 65.8440 69.5533 87.7608 102.9231 130.1193 140.0106 155.2816 167.0922 174.4236 191.2042 195.3798 219.1322 232.4231 239.8223 254.9159 256.7185 265.5018 281.3979 314.7754 315.5072 333.5786 353.2022 388.0880 397.6611 418.1967 432.6676 441.9187 451.1286 474.3971 506.8741 519.0875 549.2541 566.9724 581.8586 607.4746 645.7692 675.5083 715.2924 727.3453 740.2554 793.9801 808.1785 816.3828 827.5363 858.1070 878.0187 897.6624 908.6000 926.9666 930.7166 946.8999 956.7632 995.6314 1000.5612 1007.2094 1021.6047 1022.7547 1065.8961 1067.2881 1081.3143 1096.2866 1113.1268 1118.8460 1142.4766 1154.3748 1157.6199 1184.8825 1186.7311 1203.5531 1208.8692 1235.3359 1236.5481 1271.0795 1287.8057 1297.3749 1305.4321 1308.5072 1321.9578 1335.4473 1346.1108 1364.6822 1373.5462 1386.0894 1397.7997 1411.3557 1450.7287 1460.4095 1465.5155 1466.3773 1466.9825 1469.2582 1469.7061 1477.2369 1485.9639 1487.3236 1496.3809 1582.8516 1606.0237 1638.8198 2825.3146 2851.6790 2920.3579 2954.1963 2971.4986 2984.0405 3006.6878 3009.1255 3010.9320 3031.9690 3060.7860 3066.8818 3078.4930 3079.7389 3089.0270 3091.1743 3135.7273 3153.7065 3156.3862 3401.2654 3548.2379 3696.4677
redmass: 4.5406 4.7115 4.6222 3.7112 3.3102 3.7537 3.6999 3.6545 4.4601 6.3012 3.4332 3.9638 5.3589 2.5610 2.6830 1.7369 3.5037 2.5389 1.7882 7.8163 2.2427 3.1745 3.7418 2.7144 8.1057 5.6263 2.6927 3.3805 3.9710 1.3926 3.9939 4.6141 3.6439 3.7308 1.2053 3.6340 5.9069 2.5551 4.4754 2.3777 7.8029 10.5076 5.9500 1.7609 1.7020 1.1994 2.7000 2.4747 3.3501 2.8486 2.1142 1.7282 1.3845 2.2212 5.1062 5.6570 2.1866 1.6269 2.2013 3.4048 4.0322 4.1429 1.6865 2.1484 1.9302 1.9343 1.2549 1.9043 1.5039 1.4508 1.3738 2.4088 2.2267 2.0491 1.3267 1.3249 1.3108 1.2658 1.3128 1.3512 4.5884 1.2892 1.3627 1.2797 1.4486 1.2288 1.3497 1.2555 4.7988 2.7059 1.6007 1.0752 1.1153 1.0475 1.0860 1.1275 1.0696 1.0869 2.8864 1.0632 1.0917 8.1761 3.1787 1.4782 1.0713 1.0714 1.0846 1.0647 1.0327 1.0353 1.0858 1.0661 1.0654 1.0858 1.0969 1.1042 1.1002 1.0991 1.1005 1.1033 1.1005 1.0907 1.0923 1.0752 1.0460 1.1032
irintensity: 2.8329 0.5966 0.9050 0.5982 0.5056 1.1289 2.6719 4.4123 1.5639 3.7095 2.5530 0.6669 3.1526 0.6807 3.8011 1.0173 2.4334 1.2365 1.0440 2.1295 1.0157 2.9085 2.9828 5.2694 4.1473 19.8573 7.2753 7.8087 9.7409 73.0857 4.1612 110.1607 72.1028 68.6217 145.3022 70.8152 18.0950 16.3228 15.6340 4.0633 16.2349 6.7552 5.6662 4.7137 20.4899 8.7154 9.9663 12.9871 85.3924 77.0857 1.0985 32.5257 5.1469 2.2677 36.2949 58.0428 6.1999 11.9280 6.4567 49.5413 25.3342 8.8778 70.5221 40.2806 4.5201 13.7443 0.0655 36.9397 13.9730 41.0854 17.1961 86.0398 19.7960 22.8964 22.8435 59.6425 32.4360 1.9692 14.6239 4.0929 67.1282 0.6207 6.6809 37.2929 9.4040 10.2308 1.1436 24.8339 37.2881 28.2803 40.2998 22.8083 55.6112 5.8535 7.5939 35.2225 16.9092 10.9690 47.1077 3.7453 3.1277 39.2477 75.1878 398.5697 120.1968 164.4495 54.7183 42.2592 53.3476 31.9299 31.9670 36.5095 19.9903 56.1645 8.1683 32.6063 32.3263 42.9412 34.4221 50.7944 11.7952 2.7144 22.7501 15.9523 118.7632 37.8607
temp: 298.150 k
press: 1.00000 atm
elementType: 17 16 8 8 8 7 7 7 6 6 6 6 6 6 6 6 6 6 6 6 6 6 1 1 1 1 1 1 1 1 1 1 1 1 1 1 1 1 1 1 1 1 1 1
symmnumber: 1
zpe: 920722.1 jmol-1
zpe.correction: 0.350685 hartree
zpe.thermalcorrener: 0.374425 hartree
zpe.thermalcorrenthalpy: 0.375369 hartree
zpe.thermalcorrgfe: 0.295970 hartree
zpe.sumelectzpe: -1792.825738 hartree
zpe.sumelectthermal: -1792.801997 hartree
zpe.sumelectthermalent: -1792.801053 hartree
zpe.sumelectthermalfe: -1792.880452 hartree
dipole: 2.5298 3.8610 8.7619
dipole: 9.9035
quadrupole: -116.0497 -160.8890 -137.0863
quadrupole: 7.3513 17.1853 -10.1199
quadrupole: 21.9587 -22.8807 0.9220 7.3513 17.1853 -10.1199
hfenergy: -1793.1764221 hartree
pointgroup: C01 [X(C14H22Cl1N3O3S1)]
dipole: 1.2098211 2.1950353 2.9832017 debye
polarizability: 268.1837206|35.3687319|211.2044403|-4.6748418|-12.4889452|214.905967 unknown
InChI: InChI=1S/C14H22ClN3O3S/c1-3-18-6-4-5-10(18)9-17-22(19,20)14-7-11(15)12(16)8-13(14)21-2/h7-8,10,17H,3-6,9,16H2,1-2H3
charge 0 multiplicity 1
44 atoms
Cl 3.930504 2.258958 -2.785314
S  0.555068 -1.782272 -0.865439
O  -0.015985 -1.420659 -2.347248
O  1.150682 -3.250364 -0.531437
O  1.862112 -1.107288 1.777199
N  -3.823156 0.810427 0.490594
N  -0.847448 -1.509651 0.301132
N  4.981817 2.3071 0.064889
C  -3.093233 -0.492526 0.571297
C  -3.885233 -1.474718 -0.334119
C  -4.714782 -0.539695 -1.25163
C  -5.065733 0.6274 -0.305701
C  -1.633256 -0.274393 0.074241
C  -3.957944 1.551971 1.758236
C  -4.399804 3.01255 1.547005
C  1.861374 -0.463035 -0.522892
C  2.428146 -0.321658 0.767342
C  2.303502 0.31356 -1.604926
C  3.471551 0.604807 0.96581
C  3.333528 1.234766 -1.39215
C  3.953701 1.399769 -0.117825
C  2.554167 -1.177418 3.069829
H  -3.058446 -0.868779 1.618339
H  -4.562724 -2.096645 0.280129
H  -3.207773 -2.150871 -0.880515
H  -4.099126 -0.172852 -2.092936
H  -5.610656 -1.029895 -1.669194
H  -5.330464 1.552582 -0.848643
H  -5.935586 0.349739 0.343445
H  -1.200248 0.619541 0.571099
H  -1.666155 -0.080161 -1.012598
H  -4.680063 1.046595 2.453727
H  -2.972542 1.544936 2.263499
H  -0.441016 -1.613347 1.247722
H  -3.69179 3.532424 0.877499
H  -5.405447 3.068122 1.093177
H  -4.436285 3.549724 2.51269
H  1.836814 0.179023 -2.586431
H  3.920993 0.736769 1.954908
H  5.307524 2.865726 -0.721315
H  5.430407 2.417328 0.969047
H  3.603183 -1.499111 2.934308
H  2.004733 -1.9339 3.64786
H  2.51709 -0.203578 3.594689
