program: Orca
programVersion: 5.0.2
elementType: Cl S F O O O O O N N N N N C C C C C C C C C C C C C C C H H H H H H H H H H H H H
charge: 0
multiplicity: 1
keywords: wb97x-d3
keywords: def2-TZVPP
keywords: def2/J RIJCOSX
keywords: DEFGRID2
keywords: scfconv7
keywords: smallprint printgap noloewdin
keywords: NOSOSCF
formula: C15H13ClFN5O5S
InChI: InChI=1/C15H13ClFN5O5S/c1-3-27-15-18-10(17)7-11-19-14(20-22(11)15)28(24,25)21-12-8(13(23)26-2)5-4-6-9(12)16/h4-7,21H,3H2,1-2H3
41 atoms
Cl 4.703102 0.691819 1.740242
S  1.12853 0.862935 1.846792
F  -4.237952 0.739061 -3.107288
O  -3.912862 -0.836577 1.121427
O  0.741878 0.600067 3.214613
O  1.83717 2.065059 1.471026
O  0.493415 -1.38771 -2.435922
O  0.397997 -2.014817 -0.300556
N  -2.201596 0.297372 0.229531
N  2.01833 -0.432963 1.339438
N  -1.406183 0.187131 1.300635
N  -0.359491 1.3099 -0.372314
N  -4.099987 -0.032637 -1.026093
C  -0.344543 0.801868 0.860748
C  -1.567344 0.973181 -0.782074
C  2.778663 -0.35245 0.151502
C  2.309321 -0.814735 -1.088594
C  -3.462222 -0.20225 0.085842
C  4.063411 0.183128 0.224415
C  -2.255635 1.173047 -1.986125
C  3.126015 -0.722502 -2.211714
C  4.867965 0.27878 -0.899986
C  -3.501788 0.631229 -2.013851
C  4.394029 -0.175718 -2.116822
C  0.97275 -1.461603 -1.210906
C  -5.256265 -1.381468 1.089243
C  -6.289864 -0.329675 1.401225
C  -0.724538 -2.082993 -2.719786
H  1.549372 -1.321442 1.498425
H  -1.810436 1.698881 -2.816553
H  2.78279 -1.08961 -3.167857
H  5.863198 0.693755 -0.820224
H  5.022781 -0.113206 -2.993869
H  -5.43117 -1.856673 0.124959
H  -5.23888 -2.154255 1.853593
H  -6.330634 0.45189 0.644115
H  -7.268296 -0.809177 1.436036
H  -6.109551 0.129845 2.372406
H  -0.627954 -3.148642 -2.513766
H  -0.906921 -1.935549 -3.780177
H  -1.560521 -1.677712 -2.150606
elementType: Cl S F O N C H
totalener: -2187.70397754 hartree
nucrepener: 3207.90978666 hartree
electener: -5395.61376420 hartree
oneelecener: -9385.77806831 hartree
twoeener: 3990.16430410 hartree
cpcmener: -0.05446300 hartree
kineticenergy: 2181.03885479 hartree
xcener: -161.667864652816 hartree
chargesum: -0.0000000
charge: -0.060611 0.864465 -0.177858 -0.271334 -0.506716 -0.492644 -0.273569 -0.460395 0.185553 -0.212045 -0.300403 -0.335447 -0.379139 0.079420 0.197537 0.111410 -0.002431 0.471416 0.014905 -0.284536 -0.159612 -0.092670 0.385587 -0.147238 0.477659 0.055284 -0.258611 -0.118487 0.197183 0.155978 0.151722 0.145413 0.165212 0.101519 0.120140 0.091885 0.100568 0.093190 0.137303 0.134475 0.095921
qa: -0.0606 0.8645 -0.1779 -0.2713 -0.5067 -0.4926 -0.2736 -0.4604 0.1856 -0.2120 -0.3004 -0.3354 -0.3791 0.0794 0.1975 0.1114 -0.0024 0.4714 0.0149 -0.2845 -0.1596 -0.0927 0.3856 -0.1472 0.4777 0.0553 -0.2586 -0.1185 0.1972 0.1560 0.1517 0.1454 0.1652 0.1015 0.1201 0.0919 0.1006 0.0932 0.1373 0.1345 0.0959
va: 1.2596 5.8383 1.1218 2.2076 1.9955 1.9996 2.1217 2.0239 3.3989 3.0415 2.9041 3.0653 2.9832 4.1993 3.9961 3.8270 3.6769 4.1423 4.0386 3.8658 3.9793 3.9734 4.1863 3.9388 4.0623 3.8111 3.9326 3.8429 1.0316 1.0090 1.0163 1.0053 0.9882 1.0098 0.9926 1.0097 1.0056 1.0043 0.9963 0.9940 0.9962
dispcorr: -0.025225241 hartree
energy: -2187.729202782786
dipole: -21.27678 19.16449 -2.11229 -12.25194 10.01873 -2.23321 -8.81814 5.07526 -3.74288
magnitude: 4.84336 au
magnitude: 12.31085 debye
