program: Orca
programVersion: 5.0.2
elementType: Cl S F O O O O O N N N N N C C C C C C C C C C C C C C C H H H H H H H H H H H H H
charge: 0
multiplicity: 1
keywords: wb97x-d3
keywords: def2-TZVPP
keywords: def2/J RIJCOSX
keywords: DEFGRID2
keywords: scfconv7
keywords: smallprint printgap noloewdin
keywords: NOSOSCF
formula: C15H13ClFN5O5S
InChI: InChI=1/C15H13ClFN5O5S/c1-3-27-15-18-10(17)7-11-19-14(20-22(11)15)28(24,25)21-12-8(13(23)26-2)5-4-6-9(12)16/h4-7,21H,3H2,1-2H3
41 atoms
Cl 4.760778 1.182169 1.209264
S  1.180995 1.205683 1.705443
F  -4.284128 -3.2024 -0.328163
O  -3.928107 1.287214 0.093747
O  1.972424 0.326465 2.53582
O  0.775326 2.520248 2.150553
O  0.178317 -1.364074 -2.257937
O  0.239817 0.824453 -1.840959
N  -2.19012 -0.015308 0.633427
N  1.980808 1.409851 0.274709
N  -1.382038 0.99343 0.980216
N  -0.312326 -1.00065 1.168449
N  -4.128998 -0.99444 -0.123837
C  -0.299811 0.328674 1.274907
C  -1.543509 -1.219804 0.745965
C  2.682854 0.323937 -0.296258
C  2.116239 -0.530082 -1.255935
C  -3.471519 0.077837 0.17607
C  3.999531 0.1038 0.103276
C  -2.246718 -2.387065 0.41999
C  2.86363 -1.587236 -1.764638
C  4.738246 -0.951904 -0.407404
C  -3.522609 -2.173104 0.003089
C  4.163745 -1.798251 -1.337423
C  0.753069 -0.271283 -1.799069
C  -5.251901 1.50907 -0.456264
C  -5.239903 1.48262 -1.963537
C  -1.086187 -1.224759 -2.915283
H  1.471285 1.997324 -0.381024
H  -1.795651 -3.364407 0.495355
H  2.441799 -2.24435 -2.511204
H  5.759711 -1.10317 -0.086631
H  4.739209 -2.618851 -1.742267
H  -5.944716 0.780816 -0.037229
H  -5.522487 2.49345 -0.083243
H  -4.551614 2.222917 -2.369666
H  -4.978695 0.503332 -2.361849
H  -6.240957 1.72803 -2.31871
H  -0.993762 -0.613696 -3.81281
H  -1.837635 -0.790407 -2.257333
H  -1.386453 -2.230659 -3.191895
elementType: Cl S F O N C H
totalener: -2187.70426171 hartree
nucrepener: 3224.76075699 hartree
electener: -5412.46501870 hartree
oneelecener: -9419.24582633 hartree
twoeener: 4006.78080763 hartree
cpcmener: -0.05575043 hartree
kineticenergy: 2181.03287115 hartree
xcener: -161.665741074438 hartree
chargesum: -0.0000000
charge: -0.059849 0.867101 -0.177964 -0.272239 -0.493615 -0.506969 -0.272915 -0.459312 0.188750 -0.218114 -0.301433 -0.333947 -0.371660 0.076611 0.191374 0.118269 -0.014981 0.464019 0.019576 -0.274697 -0.164597 -0.094913 0.375862 -0.145642 0.485247 0.054866 -0.258379 -0.126818 0.198423 0.157184 0.152101 0.145498 0.165759 0.101661 0.120921 0.093848 0.091004 0.101635 0.142902 0.099139 0.136293
qa: -0.0598 0.8671 -0.1780 -0.2722 -0.4936 -0.5070 -0.2729 -0.4593 0.1887 -0.2181 -0.3014 -0.3339 -0.3717 0.0766 0.1914 0.1183 -0.0150 0.4640 0.0196 -0.2747 -0.1646 -0.0949 0.3759 -0.1456 0.4852 0.0549 -0.2584 -0.1268 0.1984 0.1572 0.1521 0.1455 0.1658 0.1017 0.1209 0.0938 0.0910 0.1016 0.1429 0.0991 0.1363
va: 1.2600 5.8376 1.1208 2.2034 2.0005 1.9951 2.1216 2.0288 3.3952 3.0381 2.8995 3.0695 2.9843 4.1908 4.0070 3.8112 3.6830 4.1435 4.0387 3.8750 3.9887 3.9734 4.2012 3.9391 4.0472 3.8104 3.9338 3.8460 1.0317 1.0079 1.0163 1.0056 0.9879 1.0090 0.9925 1.0043 1.0084 1.0063 0.9961 0.9893 0.9920
dispcorr: -0.025827140 hartree
energy: -2187.730088848113
dipole: -20.02133 17.67915 -2.34218 -1.16315 -1.09065 -2.25380 -20.92584 17.06077 -3.86507
magnitude: 5.05017 au
magnitude: 12.83651 debye
