program: Orca
programVersion: 5.0.2
elementType: Cl S F O O O O O N N N N N C C C C C C C C C C C C C C C H H H H H H H H H H H H H
charge: 0
multiplicity: 1
keywords: wb97x-d3
keywords: def2-TZVPP
keywords: def2/J RIJCOSX
keywords: DEFGRID2
keywords: scfconv7
keywords: smallprint printgap noloewdin
keywords: NOSOSCF
formula: C15H13ClFN5O5S
InChI: InChI=1/C15H13ClFN5O5S/c1-3-27-15-18-10(17)7-11-19-14(20-22(11)15)28(24,25)21-12-8(13(23)26-2)5-4-6-9(12)16/h4-7,21H,3H2,1-2H3
41 atoms
Cl 4.728943 0.772235 1.531073
S  1.151248 0.911698 1.893689
F  -4.164611 0.843508 -3.110718
O  -4.01276 -0.421166 1.23097
O  0.757025 0.626497 3.255091
O  1.876261 2.109723 1.537638
O  0.22265 -1.473404 -2.238335
O  0.321565 -2.049571 -0.089725
N  -2.202637 0.487951 0.280333
N  2.026344 -0.390044 1.373033
N  -1.424161 0.382045 1.365297
N  -0.287679 1.326696 -0.358422
N  -4.110559 0.221517 -0.976392
C  -0.317723 0.891606 0.902053
C  -1.512364 1.050671 -0.763254
C  2.694869 -0.335065 0.128385
C  2.136087 -0.835339 -1.059671
C  -3.497489 0.079083 0.153315
C  3.970704 0.223852 0.085192
C  -2.169387 1.212986 -1.989746
C  2.854175 -0.748296 -2.24785
C  4.676384 0.314038 -1.104589
C  -3.451979 0.763587 -1.999498
C  4.11259 -0.171833 -2.269486
C  0.806734 -1.508405 -1.058077
C  -5.370559 -0.92945 1.203528
C  -5.430299 -2.322843 0.631783
C  -1.01578 -2.176072 -2.38622
H  1.567021 -1.274031 1.579746
H  -1.676724 1.6435 -2.84785
H  2.440018 -1.140834 -3.165048
H  5.665361 0.750903 -1.114753
H  4.663194 -0.110543 -3.197612
H  -5.667977 -0.921203 2.249064
H  -6.007338 -0.232348 0.660575
H  -4.797705 -3.01015 1.192512
H  -6.457683 -2.679886 0.704835
H  -5.141901 -2.355644 -0.417696
H  -1.77271 -1.813352 -1.689918
H  -0.87412 -3.248191 -2.242559
H  -1.34216 -1.986699 -3.405268
elementType: Cl S F O N C H
totalener: -2187.70405532 hartree
nucrepener: 3226.96777587 hartree
electener: -5414.67183119 hartree
oneelecener: -9423.71167658 hartree
twoeener: 4009.03984539 hartree
cpcmener: -0.05459424 hartree
kineticenergy: 2181.03710126 hartree
xcener: -161.667581762841 hartree
chargesum: -0.0000000
charge: -0.060346 0.867756 -0.177814 -0.271007 -0.508282 -0.491081 -0.273735 -0.460084 0.187274 -0.212583 -0.296530 -0.336780 -0.373866 0.074451 0.190099 0.116876 -0.012443 0.466578 0.015163 -0.272684 -0.160540 -0.094122 0.377810 -0.147062 0.483076 0.054870 -0.257012 -0.133929 0.197215 0.156802 0.150607 0.144848 0.165049 0.121165 0.101012 0.093433 0.100573 0.090961 0.103731 0.143694 0.136854
qa: -0.0603 0.8678 -0.1778 -0.2710 -0.5083 -0.4911 -0.2737 -0.4601 0.1873 -0.2126 -0.2965 -0.3368 -0.3739 0.0745 0.1901 0.1169 -0.0124 0.4666 0.0152 -0.2727 -0.1605 -0.0941 0.3778 -0.1471 0.4831 0.0549 -0.2570 -0.1339 0.1972 0.1568 0.1506 0.1448 0.1650 0.1212 0.1010 0.0934 0.1006 0.0910 0.1037 0.1437 0.1369
va: 1.2591 5.8365 1.1210 2.2062 1.9949 2.0020 2.1194 2.0260 3.3977 3.0441 2.9024 3.0598 2.9861 4.1940 4.0035 3.8168 3.6752 4.1441 4.0379 3.8651 3.9861 3.9712 4.1996 3.9387 4.0421 3.8109 3.9338 3.8425 1.0337 1.0085 1.0174 1.0059 0.9882 0.9923 1.0092 1.0043 1.0061 1.0090 0.9911 0.9959 0.9910
dispcorr: -0.025816177 hartree
energy: -2187.729871498098
dipole: -20.54513 18.20244 -2.34268 -17.47897 15.21926 -2.25971 -9.79507 6.00486 -3.79021
magnitude: 4.99601 au
magnitude: 12.69886 debye
