program: Orca
programVersion: 5.0.2
elementType: Cl S F O O O O O N N N N N C C C C C C C C C C C C C C C H H H H H H H H H H H H H
charge: 0
multiplicity: 1
keywords: wb97x-d3
keywords: def2-TZVPP
keywords: def2/J RIJCOSX
keywords: DEFGRID2
keywords: scfconv7
keywords: smallprint printgap noloewdin
keywords: NOSOSCF
formula: C15H13ClFN5O5S
InChI: InChI=1/C15H13ClFN5O5S/c1-3-27-15-18-10(17)7-11-19-14(20-22(11)15)28(24,25)21-12-8(13(23)26-2)5-4-6-9(12)16/h4-7,21H,3H2,1-2H3
41 atoms
Cl 0.079026 -0.608978 -2.322258
S  0.571529 -1.089307 1.525686
F  -3.701559 3.98264 -1.507685
O  -4.488897 -0.202789 0.015681
O  -0.089564 -2.246033 2.085917
O  1.486561 -0.279241 2.301491
O  4.595834 -0.063173 1.839753
O  4.04852 -2.149621 1.256624
N  -2.438588 0.670762 0.188704
N  1.370539 -1.607897 0.179916
N  -1.892895 -0.413711 0.750151
N  -0.356277 1.245012 0.526283
N  -4.114079 1.928754 -0.761273
C  -0.670501 0.008413 0.909548
C  -1.508399 1.667628 0.045719
C  2.14418 -0.707809 -0.58098
C  3.412168 -0.324606 -0.142681
C  -3.733547 0.823472 -0.209031
C  1.654358 -0.169079 -1.769861
C  -1.9114 2.871458 -0.546791
C  4.14802 0.602108 -0.870016
C  2.404948 0.719216 -2.519467
C  -3.216954 2.901689 -0.921516
C  3.650016 1.110002 -2.058324
C  4.028341 -0.960565 1.057368
C  -5.892439 -0.128279 -0.338353
C  -6.523708 -1.433807 0.05937
C  5.282612 -0.542697 2.999845
H  0.877213 -2.338546 -0.32672
H  -1.22488 3.690587 -0.69424
H  5.127699 0.906728 -0.529369
H  2.012364 1.115661 -3.445412
H  4.234974 1.813824 -2.632722
H  -6.343222 0.711041 0.190938
H  -5.975362 0.047129 -1.410771
H  -7.581766 -1.397211 -0.197754
H  -6.080364 -2.275774 -0.470704
H  -6.446239 -1.609449 1.131626
H  5.670688 0.339145 3.499597
H  6.10912 -1.198298 2.728463
H  4.602935 -1.06823 3.66997
elementType: Cl S F O N C H
totalener: -2187.70447394 hartree
nucrepener: 3159.35157899 hartree
electener: -5347.05605293 hartree
oneelecener: -9289.23142564 hartree
twoeener: 3942.17537271 hartree
cpcmener: -0.05618826 hartree
kineticenergy: 2181.08736987 hartree
xcener: -161.673400390270 hartree
chargesum: -0.0000000
charge: -0.065907 0.875399 -0.177259 -0.264255 -0.505788 -0.498264 -0.275162 -0.452009 0.178397 -0.204612 -0.291174 -0.337725 -0.370072 0.075956 0.201161 0.145573 -0.003401 0.462840 -0.015006 -0.277448 -0.148678 -0.079793 0.373575 -0.155666 0.451014 0.041891 -0.246623 -0.123059 0.191228 0.160179 0.152348 0.147374 0.164963 0.110567 0.111015 0.093463 0.091467 0.091757 0.130940 0.122498 0.118297
qa: -0.0659 0.8754 -0.1773 -0.2643 -0.5058 -0.4983 -0.2752 -0.4520 0.1784 -0.2046 -0.2912 -0.3377 -0.3701 0.0760 0.2012 0.1456 -0.0034 0.4628 -0.0150 -0.2774 -0.1487 -0.0798 0.3736 -0.1557 0.4510 0.0419 -0.2466 -0.1231 0.1912 0.1602 0.1523 0.1474 0.1650 0.1106 0.1110 0.0935 0.0915 0.0918 0.1309 0.1225 0.1183
va: 1.2650 5.8091 1.1198 2.2051 2.0001 1.9958 2.1179 2.0407 3.3944 3.0958 2.9020 3.0602 3.0191 4.2118 4.0251 3.7297 3.7582 4.1656 4.0233 3.9019 4.0027 3.9325 4.2125 3.9451 4.1329 3.8045 3.9676 3.8515 1.0224 1.0056 1.0096 1.0015 0.9872 0.9973 0.9965 1.0054 1.0033 1.0033 0.9943 0.9934 0.9951
dispcorr: -0.023063364 hartree
energy: -2187.727537304164
dipole: -0.65439 -0.59196 -1.24635 -5.05912 7.06628 2.00716 5.69886 -8.33717 -2.63831
magnitude: 3.54158 au
magnitude: 9.00197 debye
