program: Orca
programVersion: 5.0.2
elementType: Cl S F O O O O O N N N N N C C C C C C C C C C C C C C C H H H H H H H H H H H H H
charge: 0
multiplicity: 1
keywords: wb97x-d3
keywords: def2-TZVPP
keywords: def2/J RIJCOSX
keywords: DEFGRID2
keywords: scfconv7
keywords: smallprint printgap noloewdin
keywords: NOSOSCF
formula: C15H13ClFN5O5S
InChI: InChI=1/C15H13ClFN5O5S/c1-3-27-15-18-10(17)7-11-19-14(20-22(11)15)28(24,25)21-12-8(13(23)26-2)5-4-6-9(12)16/h4-7,21H,3H2,1-2H3
41 atoms
Cl -0.070949 -0.810246 -2.21193
S  0.63076 -0.994924 1.629019
F  -3.689963 3.897139 -1.628561
O  -4.443581 -0.234623 0.051368
O  -0.010185 -2.091995 2.317359
O  1.60185 -0.14149 2.278728
O  4.673493 0.098618 1.638466
O  4.059813 -2.027296 1.330077
N  -2.406174 0.676964 0.230636
N  1.350481 -1.628698 0.285098
N  -1.849726 -0.373265 0.844923
N  -0.330134 1.288388 0.544443
N  -4.080951 1.866538 -0.806289
C  -0.631449 0.068369 0.986635
C  -1.485664 1.676506 0.042987
C  2.08256 -0.782928 -0.575609
C  3.364971 -0.354067 -0.226601
C  -3.695595 0.792117 -0.198886
C  1.532397 -0.33662 -1.776681
C  -1.895887 2.848315 -0.606198
C  4.056802 0.514602 -1.062329
C  2.238745 0.492203 -2.630482
C  -3.197291 2.846461 -0.994667
C  3.501965 0.921359 -2.264059
C  4.04275 -0.8685 0.999208
C  -5.82288 -0.214159 -0.394561
C  -6.458427 -1.501989 0.051152
C  5.435386 -0.261794 2.794587
H  0.803164 -2.364767 -0.155404
H  -1.217119 3.667859 -0.784202
H  5.047127 0.85382 -0.793071
H  1.797345 0.81342 -3.563672
H  4.054299 1.578813 -2.920362
H  -6.322468 0.649494 0.043602
H  -5.836885 -0.114529 -1.47986
H  -7.496825 -1.504669 -0.278176
H  -5.9671 -2.369893 -0.386903
H  -6.452185 -1.60106 1.136033
H  4.805663 -0.722004 3.554783
H  5.845214 0.666261 3.180848
H  6.250112 -0.936914 2.535723
elementType: Cl S F O N C H
totalener: -2187.70402912 hartree
nucrepener: 3166.87894930 hartree
electener: -5354.58297842 hartree
oneelecener: -9304.24701610 hartree
twoeener: 3949.66403767 hartree
cpcmener: -0.05598555 hartree
kineticenergy: 2181.06684220 hartree
xcener: -161.669539779192 hartree
chargesum: 0.0000000
charge: -0.067308 0.876597 -0.177505 -0.264998 -0.503438 -0.496800 -0.276548 -0.451672 0.175023 -0.198660 -0.291382 -0.333849 -0.369762 0.070903 0.201946 0.134265 -0.004711 0.462973 -0.008406 -0.275919 -0.151383 -0.078593 0.372960 -0.156068 0.456256 0.042212 -0.246412 -0.122987 0.188185 0.160434 0.150995 0.148468 0.165126 0.109316 0.112388 0.093314 0.091506 0.091707 0.118122 0.130364 0.123341
qa: -0.0673 0.8766 -0.1775 -0.2650 -0.5034 -0.4968 -0.2765 -0.4517 0.1750 -0.1987 -0.2914 -0.3338 -0.3698 0.0709 0.2019 0.1343 -0.0047 0.4630 -0.0084 -0.2759 -0.1514 -0.0786 0.3730 -0.1561 0.4563 0.0422 -0.2464 -0.1230 0.1882 0.1604 0.1510 0.1485 0.1651 0.1093 0.1124 0.0933 0.0915 0.0917 0.1181 0.1304 0.1233
va: 1.2651 5.8048 1.1197 2.2041 2.0024 1.9977 2.1183 2.0418 3.3974 3.0984 2.9003 3.0605 3.0188 4.2179 4.0243 3.7490 3.7521 4.1638 4.0173 3.9015 4.0093 3.9338 4.2146 3.9460 4.1300 3.8036 3.9672 3.8519 1.0258 1.0054 1.0114 1.0011 0.9873 0.9972 0.9967 1.0054 1.0033 1.0034 0.9952 0.9942 0.9927
dispcorr: -0.023163558 hartree
energy: -2187.727192678948
dipole: -0.19052 -1.16736 -1.35788 -4.71938 6.53308 1.81370 4.40357 -7.32996 -2.92638
magnitude: 3.70096 au
magnitude: 9.40709 debye
