program: Orca
programVersion: 5.0.2
elementType: Cl S F O O O O O N N N N N C C C C C C C C C C C C C C C H H H H H H H H H H H H H
charge: 0
multiplicity: 1
keywords: wb97x-d3
keywords: def2-TZVPP
keywords: def2/J RIJCOSX
keywords: DEFGRID2
keywords: scfconv7
keywords: smallprint printgap noloewdin
keywords: NOSOSCF
formula: C15H13ClFN5O5S
InChI: InChI=1/C15H13ClFN5O5S/c1-3-27-15-18-10(17)7-11-19-14(20-22(11)15)28(24,25)21-12-8(13(23)26-2)5-4-6-9(12)16/h4-7,21H,3H2,1-2H3
41 atoms
Cl 4.570098 0.039124 1.684542
S  1.427197 1.779676 1.254737
F  -5.192723 1.012218 -1.745266
O  -2.436833 -1.798203 0.486582
O  1.648576 0.997726 2.449606
O  1.609894 3.212586 1.227479
O  -0.245917 -1.224218 -2.16666
O  0.811616 0.735424 -2.219182
N  -1.874515 0.351193 0.249066
N  2.379595 1.151828 0.05399
N  -0.694564 0.230194 0.866675
N  -0.981198 2.342555 0.085375
N  -3.86587 -0.383043 -0.634574
C  -0.232257 1.442947 0.720265
C  -2.045054 1.62641 -0.226953
C  2.508345 -0.252699 -0.045772
C  1.697513 -1.03507 -0.884741
C  -2.779674 -0.641833 0.017158
C  3.477933 -0.887654 0.728231
C  -3.224284 1.918073 -0.925428
C  1.84986 -2.417624 -0.898204
C  3.617246 -2.266669 0.716553
C  -4.059699 0.856722 -1.081842
C  2.794081 -3.028513 -0.091846
C  0.720344 -0.400717 -1.811173
C  -3.312794 -2.937311 0.298206
C  -4.396744 -2.983783 1.343574
C  -1.175497 -0.767005 -3.155991
H  2.264225 1.643559 -0.829606
H  -3.426805 2.902157 -1.319227
H  1.237552 -3.026784 -1.546904
H  4.371954 -2.739355 1.329665
H  2.901685 -4.103967 -0.105767
H  -3.71599 -2.920786 -0.713607
H  -2.645376 -3.790658 0.387233
H  -4.970685 -3.899473 1.200904
H  -3.978795 -3.006201 2.349413
H  -5.086625 -2.144899 1.266965
H  -0.674207 -0.58703 -4.106072
H  -1.687127 0.140819 -2.83999
H  -1.897307 -1.56813 -3.275007
elementType: Cl S F O N C H
totalener: -2187.70363946 hartree
nucrepener: 3273.04618943 hartree
electener: -5460.74982889 hartree
oneelecener: -9515.49178891 hartree
twoeener: 4054.74196002 hartree
cpcmener: -0.05530487 hartree
kineticenergy: 2181.05168753 hartree
xcener: -161.669597245161 hartree
chargesum: -0.0000000
charge: -0.060142 0.869157 -0.177447 -0.270331 -0.490312 -0.505153 -0.273854 -0.458495 0.170784 -0.214382 -0.310042 -0.320560 -0.369994 0.087808 0.199802 0.117135 -0.011941 0.454518 0.008615 -0.264959 -0.160788 -0.089696 0.365940 -0.148746 0.481095 0.052581 -0.256662 -0.144504 0.197320 0.158270 0.150012 0.144895 0.164817 0.101353 0.120202 0.100311 0.093246 0.091472 0.146756 0.117772 0.134145
qa: -0.0601 0.8692 -0.1774 -0.2703 -0.4903 -0.5052 -0.2739 -0.4585 0.1708 -0.2144 -0.3100 -0.3206 -0.3700 0.0878 0.1998 0.1171 -0.0119 0.4545 0.0086 -0.2650 -0.1608 -0.0897 0.3659 -0.1487 0.4811 0.0526 -0.2567 -0.1445 0.1973 0.1583 0.1500 0.1449 0.1648 0.1014 0.1202 0.1003 0.0932 0.0915 0.1468 0.1178 0.1341
va: 1.2590 5.8271 1.1200 2.1952 1.9980 2.0039 2.1220 2.0274 3.3991 3.0366 2.8483 3.1182 2.9738 4.1806 4.0238 3.8145 3.6637 4.1325 4.0381 3.8863 3.9878 3.9693 4.2047 3.9429 4.0325 3.8142 3.9370 3.8423 1.0344 1.0071 1.0187 1.0057 0.9883 1.0084 0.9922 1.0060 1.0040 1.0098 0.9960 0.9908 0.9921
dispcorr: -0.026891929 hartree
energy: -2187.730531388320
dipole: -17.34248 14.65893 -2.68355 -22.55999 18.12057 -4.43942 -8.37573 5.81045 -2.56528
magnitude: 5.78710 au
magnitude: 14.70964 debye
